{"text_format":"1","workbook":"xlsx","n_sheets":17,"sheets":["Erläuterung","Bewertung-2.1.1","Bauteilkostenübersicht","Bauteile","Bauteilreinigung","Bodenreinigung","Energieversorgung","Wasser_Abwasser","KT_Reinigung","KT_Bodenreinigung","KT_NDauern","KT_DIN276","KT_regNutzungskosten","KT Energieträger","Konfiguration","Gültigkeiten","Tabelle2"],"not_rendered":{"charts":1,"images":1,"macros":1,"external_links":1,"defined_names":58,"comments":0,"pivot_tables":0},"unopened":[],"bounds":{"document_bytes":16777216,"sheet_cells":100000,"rows_first":2000,"rows_last":500,"rows_between":2000,"halvings":0,"cell_chars":16384,"cell_head_chars":4096},"cells_cut":0,"cells_raw":0,"read":"whole","date_system":"1900"}

{"sheet":"Erläuterung","index":0,"n_rows":24,"n_cols":2,"rows_kept":24,"cut":false,"hidden":false,"merged":[]}
["Erläuterung zum Excel-Werkzeug Kriterium 2.1.1 (V_BNB_BN_2015)"]
[]
[]
["Allgemeiner Hinweis\n","Das Excel-Werkzeug Kriterium 2.1.1 wurde entwickelt als Berechnungshilfe für die Ermittlung der Lebenszykluskosten (LCC) nach BNB. Maßgebend ist die Umsetzung der im Steckbrief definierten Rahmenbedingungen. Das vorliegende Excel-Werkzeug Kriterium 2.1.1 wird für die Anwendung des BNB_BN 2015, BNB_BK_2017, BNB_UN_2017 und BNB_UK_2017 zur Verfügung gestellt. "]
[null,"Das Excel-Werkzeug Kriterium 2.1.1 wurde geschrieben unter MS-Excel 2010 und nutzt Makros.\nDie Ausführung von Makros muss gestattet werden."]
["Hinweis zur Fehlermeldung bei Makroaktivierung:","Bei der Anwendung dieses Tools können Fehlermeldungen in Bezug auf die Aktivierung von Makros auftreten. Diese stehen in der Regel im Zusammenhang mit dem Speicherort der Datei und den IT-Sicherheitseinstellungen in Verwaltungen. Da Makros im Allgemeinen als Sicherheitslücken eingestuft werden, besteht  hier als eine mögliche Lösung, die Excel-Datei an einem \"vertrauenswürdigen Speicherort\" abzuspeichern und dort zu öffnen. \nDie Vorgehensweise ist wie folgt:\n1. Excel Datei Öffnen\n2. Den Menüpunkt „Datei“ Öffnen\n3. Den Menüpunkt „Optionen“ Öffnen\n4. Den Menüpunkt „Trust Center“ Öffnen\n5. Den Button für „Einstellungen für das Trust Center…“ Öffnen\n6. Und den Menüpunkt „Vertrauenswürdige Speicherorte“ Anklicken\n"]
[]
["Allgemeine Funktionsweise","Automatisch berechnete Felder sind dunkelgrau, Eingabefelder hellgrau hinterlegt. \nIn den Tabellen \" Bauteile\", \"Bauteilreinigung\", \"Bodenreinigung\" und \"Energieversorgung\" wird jeweils über den Button + xy hinzufügen + eine neue Eingabezeile erzeugt, das Löschen der Zeile ist über den x-Button am Zeilenanfang möglich.\nIn den Tabellen \" Bauteile\", \"Bauteilreinigung\" und \"Bodenreinigung\" sind jeweils in einzelnen Spalten Sortierbutton ergänzt, so dass wahlweise nach unterschiedlichen Kriterien sortiert werden kann.\nÜber die Schalter \"+\" bzw. \"-\" oberhalb der Spaltenbezeichnungen der Tabellenbereiche können zur besseren Übersicht einzelne Tabellenbereiche ein- bzw. ausgeblendet werden."]
[]
["Tabelle „Bewertung 2.1.1“","Ist die Ergebnistabelle der Barwerte für alle eingegebenen Herstellungs- und Nutzungskosten. Der erreichte BNB-Punktwert wird ebenfalls ausgewiesen. Außerdem werden die einzelnen Herstellungs-/ Nutzungskostenanteile grafisch dargestellt. "]
[]
["Tabelle „Bauteilkostenübersicht“","Ist die Ergebnistabelle zur Kontrolle und Überprüfung der eingegebenen Bauteilkosten mit den Zwischensummen der einzelnen Kostengruppen."]
[]
["Tabelle „Bauteile“","Hier können Sie die Herstellungskosten für die KGR 300, 400 und je nach Erfordernis 500 bauteilbezogen erfassen. Für jedes Bauteil werden zunächst eine Bezeichnung, der Einbauort und optional über das Eingabefeld \"OZ\" eine beliebige Ordnungszahl erfasst. \nIn dem Bereich Grunddaten (Spalte F-I) wird die Kostengruppe (über Auswahlfeld) zugeordnet. Außerdem wird die LCC-Relevanz (Standard Ja; Nein für Gebäude mit erhöhten baulichen Anforderungen, bei denen Sonderbedingungen geltend gemacht werden können, indem projektspezifische Mehrkosten abgezogen bzw. anzusetzende Kosten eingetragen werden.) und die Kostenzuordnung zum Bestand (Standard bzw. für Neubau immer Nein) abgefragt. Optional ist ein Kommentar pro Bauteil möglich (Spalte I). Die aufzuführenden Mehrkosten sind als separate Zeile einzufügen und über das Auswahlfeld \"LCC\" (Spalte G) mit \"Nein\" zuzuordnen, wodurch sie automatisch in den Spalten P-Q ausgewiesen und aus der Berechnung herausgenommen werden. \nIm Bereich Herstellungskosten (Spalte M-O) erfolgt die Eingabe der tatsächlichen Netto-Herstellungskosten. Die Preisindizierung auf das Bezugsjahr des Steckbriefes wird automatisch berechnet. Voraussetzung ist die Eingabe des entsprechenden Preisindex in der Tabelle \"Konfiguration\".\nIm Bereich Nutzungsdauer (Spalte S-Y) kann über ein Auswahlfeld die entsprechende Nutzungsdauer zugeordnet werden. Standardmäßig ist 1 Jahr als ND voreingestellt. Damit ist die Angabe der Nutzungsdauer unerlässlich. Die hinterlegten Nutzungsdauern der KGR 300 entsprechen den Werten der Tabelle \"Nutzungsdauern von Bauteilen\" gemäß Veröffentlichung auf dem Internetportal Nachhaltiges Bauen des BMVBS --> siehe auch http://www.nachhaltigesbauen.de/baustoff-und-gebaeudedaten/nutzungsdauern-von-bauteilen.html).\nFür die KGR 400 sind die Angaben zur mittleren Lebensdauer der VDI 2067: 2000 enthalten. Falls die in den Spalten E + F zuvor definierte Kostengruppe von der im Auswahlfeld der Spalte S benannten KGR (3.Ebene) abweicht, bleibt das Feld gelb markiert. Falls keine eindeutige Zuordnung gefunden werden kann, ist auch eine Handeingabe möglich. Handeingaben bzw. Abweichungen sind zu begründen. \nIm Bereich regelmäßige Kosten (Spalte AC-AI) werden jedem Bauteil die Inspektions- und Wartungskosten sowie die regelmäßigen Instandsetzungskosten wiederum über ein Auswahlfeld zugewiesen. Gemäß Anlage 3 des Steckbriefes werden für die KGR 300 einheitlich für die Inspektions- und Wartungskosten 0,1% der Herstellungskosten und 0,35% für die Instandsetzungskosten angesetzt. Für die KGR 400 sind ebenfalls gemäß Anlage 2 die je nach Kostengruppe unterschiedlichen Inspektions- und Wartungskosten sowie die laufenden Instandsetzungskosten zuzuordnen. Außerdem besteht zusätzlich die Option der Handeingabe für abweichende laufende Kosten (z.B. gemäß Wartungsvertrag).\nAlle weiteren Spalten beinhalten Ergebniswerte der Berechnung des Barwertes auf Basis der vorab beschriebenen Eingaben für den vorgegebenen Betrachtungszeitraum. Die Einzelwerte sind jahresweise ablesbar. Grundsätzich bezieht sich die Berechnung auf die preisindizierten Herstellungskosten, wobei die Preisinidzierung bei der Handgabe (Spalte AH + AI) eigenständig vorzunehmen ist. "]
[]
["Tabelle „Bauteilreinigung“","In dieser Tabelle werden nachvollziehbar die zu reinigenden Bauteile über die Bauteilbezeichnung, den Einbauort und die entsprechende zu reinigende Fläche erfasst. Zu beachten ist die Anzahl der zu reinigenden Seiten (z.B. Fenster 2x). Wesentlich ist die Zuordnung über das Auswahlfeld der Spalte F gemäß Zugänglichkeit und Bauteiloberfläche für die Ermittlung des Reinigungsaufwandes. Die Berechnung der Reinigungskosten erfolgt automatisch über die hinterlegten Kostenkennwerte entsprechend Steckbrief Anlage 1.\nDie weiteren Spalten beinhalten die Ergebniswerte der Berechnung des Barwertes für den vorgegebenen Betrachtungszeitraum. Die Einzelwerte sind jahresweise ablesbar.\n"]
[]
["Tabelle „Bodenreinigung“","In dieser Tabelle werden nachvollziehbar die zu reinigenden Bodenflächen über die Raumbezeichnung, die Raumnummer und die entsprechende zu reinigende Bodenfläche erfasst. Wesentlich ist die Zuordnung über das Auswahlfeld der Spalte F gemäß Oberflächentyp/ -material und Belastung für die Ermittlung des Reinigungsaufwandes. Die Berechnung der Reinigungskosten erfolgt automatisch über die hinterlegten Kostenkennwerte entsprechend Steckbrief Anlage 1.\nDie weiteren Spalten beinhalten die Ergebniswerte der Berechnung des Barwertes für den vorgegebenen Betrachtungszeitraum. Die Einzelwerte sind jahresweise ablesbar.\n"]
[]
["Tabelle „Energieversorgung“","Mit der Auswahl des Energieträgers werden die Energiekosten gemäß Anlage 3 des Steckbriefs automatisch zugeordnet.\nDie weiteren Spalten beinhalten die Ergebniswerte der Berechnung des Barwertes für den vorgegebenen Betrachtungszeitraum. Die Einzelwerte sind jahresweise ablesbar.\n"]
[]
["Tabelle „Wasser-/ Abwasser“","In dieser Tabelle werden der Gesamtfrischwasserbedarf, das Abwasseraufkommen aus Brauchwasser und die in die Kanalisation eingeleiteten Niederschlagsmengen über die Größe der versiegelten Flächen erfasst und die entsprechenden jährlichen Kosten über die Kostenkennwerte gemäß Anlage 3 des Steckbriefes automatisch berechnet. Für die Berechnung der Frischwasser- und Abwassermengen steht gesondert das Excel-Werkzeug Kriterium 1.2.3 zur Verfügung.\nDie weiteren Spalten beinhalten die Ergebniswerte der Berechnung des Barwertes für den vorgegebenen Betrachtungszeitraum. Die Einzelwerte sind jahresweise ablesbar.\n"]
[]
["Tabelle „Konfiguration“","Diese Tabelle beinhaltet mit Betrachtungszeitraum, allgemeine Preissteigerung, Preissteigerung Energie und Kalkulationszins die grundlegenden Rahmenparameter der Lebenszykluskostenberechnung. Diese Werte sind mit BNB-Modul bzw. Version eindeutig definiert. Außerdem ist hier projektbezogen der entsprechende Baupreisindex für Bürogebäude einzugeben, da jede BNB-Version sich auf einen definierten Preisstand bezieht. Der jeweils relevante Baupreisindex ist der Tabelle des statistischen Bundesamteszu entnehmen --> https://www.destatis.de/DE/ZahlenFakten/Indikatoren/Konjunkturindikatoren/Preise/bpr110.html \nAls objektbezogener Wert sind die Kategorie der Lebenszykluskosten und die Bruttogeschossfläche BGF einzugeben, damit die flächenbezogene Berechnung des Barwertes möglich ist. \nAbweichende Werte für die Rahmenparameter erhöhen die flexible Anwendung des Excel-Werkzeugs für alternative Wirtschaftlichkeitsbetrachtungen, unabhängig vom BNB-System. \n"]

{"sheet":"Bewertung-2.1.1","index":1,"n_rows":58,"n_cols":30,"rows_kept":58,"cut":false,"hidden":false,"merged":[[0,0,0,1],[7,9,21,9],[7,10,21,10],[1,1,1,2],[2,1,2,2],[3,1,3,2],[4,1,4,2],[26,9,37,9],[26,10,37,10],[46,9,56,9],[46,10,56,10],[32,2,33,2]]}
["Berechnung LCC nach BNB BN 2.1.1 v2015 \nZusammenfassung",null,null,"BBR-LCC\nVer. 15-1.1/20180109\nBBR A1",null,null,{"$f":"Konfiguration!N2","v":"BNB_BN 2015"},{"$f":"K8","v":77.536143017527806}]
["Projekt:","Beispieleingabe\n\n(Szenario: 10 Mio Euro netto Herstellungskosten für KG 300 und 400)\n",null,null,null,null,{"$f":"Konfiguration!N3","v":"BNB_UN 2017 Schulgebäude"},{"$f":"K27","v":100}]
["Projektnummer:"]
["Bearbeiter:"]
["LCC-Stand:","2018-01-08"]
[null,null,null,null,null,null,{"$f":"G1","v":"BNB_BN 2015"}]
[null,"Indikator","Wert",null,null,null,"Punkte","Maßstab ","Maßstab ","LCC","Punktzahl"]
[1,"Herstellungskosten KG 300 ",{"$f":"ERG_Herstell300","v":7032142.8571428573},null,null,null,100,{"$f":"3300-0.01","v":3299.99},null,{"$f":"IF(AND(ISNUMBER(C32),C32>0),C32,LCC)","v":3973.9057094741656},{"$f":"IF(Konfiguration!B19=1, P23, U23)","v":77.536143017527806},{"$f":"IF($J$8<=H8,1,0)","v":0},{"$f":"IF($J$8>0,1,0)","v":1},{"$f":"G8*L8*M8","v":0},{"$f":"IF($J$8<=H8,1,0)","v":0},{"$f":"N8*O8","v":0},{"$f":"IF($J$8<=I8,1,0)","v":0},{"$f":"IF($J$8>0,1,0)","v":1},{"$f":"G8*Q8*R8","v":0},{"$f":"IF($J$8<=I8,1,0)","v":0},null,null,null,null,null,null,null,{"$f":"A8","v":1},"Herst. KG 300",{"$f":"(C8-C9)/BGFabc","v":879.01785714285711}]
[2,"Kosten durch Sonderbedingungen",{"$f":"SUM(IF((Bauteile!G1:G100028=\"nein\"),IF(MID(Bauteile!E1:E100028,1,1)=\"3\",Bauteile!R1:R100028)))","v":0}]
[3,"Herstellungskosten KG 400",{"$f":"ERG_Herstell400","v":2789285.7142857136},null,null,null,90,{"$f":"3600-0.01","v":3599.99},null,null,null,{"$f":"IF($J$8<=H10,1,0)","v":0},{"$f":"IF($J$8>H8,1,0)","v":1},{"$f":"G10*L10*M10","v":0},{"$f":"IF($J$8<=H10,1,0)","v":0},{"$f":"N10+M10*O10*(G8-G10)*(H10-$J$8)/(H10-H8)","v":0},{"$f":"IF($J$8<=I10,1,0)","v":0},{"$f":"IF($J$8>I8,1,0)","v":1},{"$f":"G10*Q10*R10","v":0},{"$f":"IF($J$8<=I10,1,0)","v":0},null,null,null,null,null,null,null,3,"Herst. KG 400+500",{"$f":"((C10+C12)-(C11+C13))/BGFabc","v":348.66071428571422}]
[4,"Kosten durch Sonderbedingungen",{"$f":"SUM(IF((Bauteile!G1:G100028=\"nein\"),IF(MID(Bauteile!E1:E100028,1,1)=\"4\",Bauteile!R1:R100028)))","v":0}]
[5,"Herstellungskosten KG 500",{"$f":"ERG_Herstell500","v":0},null,null,null,80,{"$f":"3900-0.01","v":3899.99},null,null,null,0,{"$f":"IF($J$8>H10,1,0)","v":1},0,0,{"$f":"N12+M12*O12*(G10-G12)*(H12-$J$8)/(H12-H10)","v":0},0,{"$f":"IF($J$8>I10,1,0)","v":1},0,0,null,null,null,null,null,null,null,{"$f":"A16","v":9},"Ersatzinvestitionen KG 300",{"$f":"C16/BGFabc","v":25.039244947627346}]
[6,"Kosten durch Sonderbedingungen",{"$f":"SUM(IF((Bauteile!G1:G100028=\"nein\"),IF(MID(Bauteile!E1:E100028,1,1)=\"5\",Bauteile!R1:R100028)))","v":0}]
[7,"Herstellungskosten KG 300 + 400 +  500",{"$f":"C8+C10+C12","v":9821428.5714285709}]
[8,"Kosten durch Sonderbedingungen",{"$f":"C9+C11+C13","v":0},null,null,null,70,{"$f":"4200-0.01","v":4199.99},null,null,null,1,{"$f":"IF($J$8>H12,1,0)","v":1},70,1,{"$f":"N15+M15*O15*(G12-G15)*(H15-$J$8)/(H15-H12)","v":77.536143017527806},0,{"$f":"IF($J$8>I12,1,0)","v":1},0,0,null,null,null,null,null,null,null,{"$f":"A17","v":10},"Ersatzinvestitionen KG 400+500",{"$f":"C17/BGFabc","v":454.56440762146377}]
[9,"Barwert Ersatzinvestitionen KG 300 ",{"$f":"ERG_BARERSATZ300","v":200313.95958101877},null,null,null,60,{"$f":"4500-0.01","v":4499.99},null,null,null,1,{"$f":"IF($J$8>H15,1,0)","v":0},0,1,{"$f":"N16+M16*O16*(G15-G16)*(H16-$J$8)/(H16-H15)","v":0},0,{"$f":"IF($J$8>I15,1,0)","v":1},0,0,null,null,null,null,null,null,null,{"$f":"A19","v":12},"Inspektion und Wartung KG 300",{"$f":"C19/BGFabc","v":49.943552377526942}]
[10,"Barwert Ersatzinvestitionen KG 400 + 500",{"$f":"ERG_BARERSATZ400+ERG_BARERSATZ500","v":3636515.2609717101},null,null,null,50,{"$f":"4800-0.01","v":4799.99},null,null,null,1,0,0,1,0,0,1,0,0,null,null,null,null,null,null,null,{"$f":"A20","v":13},"Inspektion und Wartung KG 400+500",{"$f":"C20/BGFabc","v":173.81681545110061}]
[11,"Barwert Ersatzinvestitionen KG 300 + 400 + 500",{"$f":"C16+C17","v":3836829.220552729},null,null,null,40,{"$f":"5200-0.01","v":5199.99},null,null,null,1,0,0,1,0,0,1,0,0,null,null,null,null,null,null,null,{"$f":"A22","v":15},"Instandhaltung KG 300",{"$f":"C22/BGFabc","v":174.80243332134424}]
[12,"Barwert regelmäßige Inspektion und Wartung KG 300",{"$f":"ERG_BARWART300","v":399548.41902021552},null,null,null,30,{"$f":"5600-0.01","v":5599.99},null,null,null,1,0,0,1,0,0,1,0,0,null,null,null,null,null,null,null,{"$f":"A23","v":16},"Instandhaltung KG 400+500",{"$f":"C23/BGFabc","v":180.62964612248754}]
[13,"Barwert regelmäßige Inspektion und Wartung KG 400 + 500",{"$f":"ERG_BARWART400+ERG_BARWART500","v":1390534.5236088049},null,null,null,20,{"$f":"6000-0.01","v":5999.99},null,null,null,1,0,0,1,0,0,1,0,0,null,null,null,null,null,null,null,{"$f":"A27","v":20},"Reinigung",{"$f":"C27/BGFabc","v":403.28551909654294}]
[14,"Barwert regelmäßige Inspektion und Wartung KG 300 + 400 + 500",{"$f":"C19+C20","v":1790082.9426290204},null,null,null,10,{"$f":"6400","v":6400},null,null,null,{"$f":"IF($J$8>H20,1,0)","v":0},0,0,{"$f":"IF($J$8<H21,1,0)","v":1},0,{"$f":"IF($J$8>I20,1,0)","v":1},1,10,{"$f":"IF($J$8<I21,1,0)","v":0},null,null,null,null,null,null,null,{"$f":"A28","v":21},"Energie",{"$f":"C28/BGFabc","v":1217.3850163864997}]
[15,"Barwert regelmäßige Instandsetzungskosten KG 300",{"$f":"ERG_BARINST300","v":1398419.4665707538},null,null,null,0,"Kein Nachweis","Kein Nachweis",null,null,null,null,null,null,0,null,null,null,null,null,null,null,null,null,null,null,{"$f":"A29","v":22},"Wasser/ Abwasser",{"$f":"C29/BGFabc","v":66.760502721000961}]
[16,"Barwert regelmäßige Instandsetzungskosten KG 400 + 500",{"$f":"ERG_BARINST400+ERG_BARINST500","v":1445037.1689799004},null,null,null,null,null,null,null,null,null,null,null,null,{"$f":"SUM(P8:P22)","v":77.536143017527806}]
[17,"Barwert regelmäßige Instandsetzungskosten KG 300 + 400 + 500",{"$f":"C22+C23","v":2843456.6355506545}]
[18,"Barwert regelmäßige Kosten Bauteilreinigung",{"$f":"ERG_Reinigung","v":1294490.8825476358},null,null,null,{"$f":"G2","v":"BNB_UN 2017 Schulgebäude"}]
[19,"Barwert regelmäßige Kosten Bodenreinigung",{"$f":"ERG_Bodenreinigung","v":1931793.2702247081},null,null,null,"Punkte","Maßstab Kategorie I","Maßstab Kategorie II","LCC","Punktzahl"]
[20,"Barwert regelmäßige Kosten Reinigung",{"$f":"C25+C26","v":3226284.1527723437},null,null,null,100,3700,null,{"$f":"IF(AND(ISNUMBER($C$32),$C$32>0),$C$32,LCC)","v":3973.9057094741656},100,{"$f":"IF($J27<=H27,1,0)","v":0},{"$f":"IF($J27>0,1,0)","v":1},{"$f":"G27*L27*M27","v":0},{"$f":"IF($J$27<=H27,1,0)","v":0},{"$f":"N27*O27","v":0},{"$f":"IF($J27<=I27,1,0)","v":0},{"$f":"IF($J27>0,1,0)","v":1},{"$f":"G27*Q27*R27","v":0},{"$f":"IF($J27<=I27,1,0)","v":0}]
[21,"Barwert regelmäßige Kosten Energie",{"$f":"ERG_Energie","v":9739080.131091997},null,null,null,90,3830,null,null,null,{"$f":"IF($J27<=H28,1,0)","v":0},{"$f":"IF($J27>H27,1,0)","v":1},{"$f":"G28*L28*M28","v":0},0,{"$f":"N28+M28*O28*(G27-G28)*(H28-$J27)/(H28-H27)","v":0},{"$f":"IF($J27<=I28,1,0)","v":0},{"$f":"IF($J27>I27,1,0)","v":1},0,{"$f":"IF($J27<=I28,1,0)","v":0}]
[22,"Barwert regelmäßige Kosten Wasser / Abwasser",{"$f":"ERG_Wasser","v":534084.02176800766},null,null,null,80,3960,null,null,null,{"$f":"IF($J27<=H29,1,0)","v":0},{"$f":"IF($J27>H28,1,0)","v":1},{"$f":"G29*L29*M29","v":0},0,{"$f":"N29+M29*O29*(G28-G29)*(H29-$J27)/(H29-H28)","v":0},{"$f":"IF($J27<=I29,1,0)","v":0},{"$f":"IF($J27>I28,1,0)","v":1},0,{"$f":"IF($J27<=I29,1,0)","v":0}]
[23,"Barwert Gesamt",{"$f":"C14+C18+C21+C24+C27+C28+C29","v":31791245.675793324},null,null,null,70,4090,null,null,null,{"$f":"IF($J27<=H30,1,0)","v":1},{"$f":"IF($J27>H29,1,0)","v":1},70,1,{"$f":"N30+M30*O30*(G29-G30)*(H30-$J27)/(H30-H29)","v":78.930330040448794},{"$f":"IF($J27<=I30,1,0)","v":0},{"$f":"IF($J27>I29,1,0)","v":1},0,{"$f":"IF($J27<=I30,1,0)","v":0}]
[24,"Lebenszykluskosten je m² BGF",{"$f":"IF(ISNUMBER(C30/Konfiguration!B20),C30/Konfiguration!B20,\"Daten fehlen\")","v":3973.9057094741656},null,null,null,60,4220,null,null,null,{"$f":"IF($J27<=H31,1,0)","v":1},{"$f":"IF($J27>H30,1,0)","v":0},0,1,{"$f":"N31+M31*O31*(G30-G31)*(H31-$J27)/(H31-H30)","v":0},{"$f":"IF($J27<=I31,1,0)","v":0},{"$f":"IF($J27>I30,1,0)","v":1},0,{"$f":"IF($J27<=I31,1,0)","v":0}]
[25,"Alternativ: Handeingabe Lebenszykluskosten je m² BGF",null,null,null,null,50,4350,null,null,null,{"$f":"IF($J27<=H32,1,0)","v":1},{"$f":"IF($J27>H31,1,0)","v":0},0,1,{"$f":"N32+M32*O32*(G31-G32)*(H32-$J27)/(H32-H31)","v":0},{"$f":"IF($J27<=I32,1,0)","v":0},{"$f":"IF($J27>I31,1,0)","v":1},0,{"$f":"IF($J27<=I32,1,0)","v":0}]
[null,"Punktzahl 2.1.1",{"$f":"IF(ISNUMBER(VLOOKUP(Konfiguration!B3,G1:H3,2,FALSE)),VLOOKUP(Konfiguration!B3,G1:H3,2,FALSE),\"Daten fehlen\")","v":77.536143017527806}]
[null,{"$f":"Konfiguration!B3","v":"BNB_BN 2015"},null,null,null,null,40,4513,null,null,null,{"$f":"IF($J27<=H34,1,0)","v":1},{"$f":"IF($J27>H32,1,0)","v":0},0,1,{"$f":"N34+M34*O34*(G32-G34)*(H34-$J27)/(H34-H32)","v":0},{"$f":"IF($J27<=I34,1,0)","v":0},{"$f":"IF($J27>I32,1,0)","v":1},0,{"$f":"IF($J27<=I34,1,0)","v":0}]
[null,null,null,null,null,null,30,4625,null,null,null,{"$f":"IF($J27<=H35,1,0)","v":1},{"$f":"IF($J27>H34,1,0)","v":0},0,1,{"$f":"N35+M35*O35*(G34-G35)*(H35-$J27)/(H35-H34)","v":0},{"$f":"IF($J27<=I35,1,0)","v":0},{"$f":"IF($J27>I34,1,0)","v":1},0,{"$f":"IF($J27<=I35,1,0)","v":0}]
[null,null,null,null,null,null,20,4838,null,null,null,{"$f":"IF($J27<=H36,1,0)","v":1},{"$f":"IF($J27>H35,1,0)","v":0},0,1,{"$f":"N36+M36*O36*(G35-G36)*(H36-$J27)/(H36-H35)","v":0},{"$f":"IF($J27<=I36,1,0)","v":0},{"$f":"IF($J27>I35,1,0)","v":1},0,{"$f":"IF($J27<=I36,1,0)","v":0}]
[null,null,null,null,null,null,10,5000,null,null,null,{"$f":"IF($J27>H36,1,0)","v":0},{"$f":"IF($J27>H36,1,0)","v":0},0,{"$f":"IF($J$27<H37,1,0)","v":1},{"$f":"N37+M37*O37*(G36-G37)*(H37-$J27)/(H37-H36)","v":0},{"$f":"IF($J27>I36,1,0)","v":1},{"$f":"IF($J27>I36,1,0)","v":1},10,{"$f":"IF($J27<I37,1,0)","v":0}]
[null,null,null,null,null,null,0,"Kein Nachweis","Kein Nachweis",null,null,null,null,null,null,0]
[null,null,null,null,null,null,null,null,null,null,null,null,null,null,null,{"$f":"SUM(P27:P38)","v":78.930330040448794},null,null,null,null,{"$f":"SUM(U27:U38)","v":0}]
[]
[]
[]
[]
[]
[null,null,null,null,null,null,{"$f":"G3","v":0}]
[null,null,null,null,null,null,"Punkte","Maßstab Kategorie I","Maßstab Kategorie II","LCC","Punktzahl"]
[null,null,null,null,null,null,100,{"$f":"3050-0.01","v":3049.99},null,{"$f":"IF(AND(ISNUMBER($C$32),$C$32>0),$C$32,LCC)","v":3973.9057094741656},100,{"$f":"IF($J47<=H47,1,0)","v":0},{"$f":"IF($J47>0,1,0)","v":1},{"$f":"G47*L47*M47","v":0},{"$f":"IF($J47<=H47,1,0)","v":0},{"$f":"N47*O47","v":0},{"$f":"IF($J47<=I47,1,0)","v":0},{"$f":"IF($J47>0,1,0)","v":1},{"$f":"G47*Q47*R47","v":0},{"$f":"IF($J47<=I47,1,0)","v":0}]
[null,null,null,null,null,null,90,{"$f":"3130-0.01","v":3129.99},null,null,null,{"$f":"IF($J47<=H48,1,0)","v":0},{"$f":"IF($J47>H47,1,0)","v":1},{"$f":"G48*L48*M48","v":0},{"$f":"IF($J47<=H48,1,0)","v":0},{"$f":"N48+M48*O48*(G47-G48)*(H48-$J47)/(H48-H47)","v":0},{"$f":"IF($J47<=I48,1,0)","v":0},{"$f":"IF($J47>I47,1,0)","v":1},0,{"$f":"IF($J47<=I48,1,0)","v":0}]
[null,null,null,null,null,null,80,{"$f":"3210-0.01","v":3209.99},null,null,null,{"$f":"IF($J47<=H49,1,0)","v":0},{"$f":"IF($J47>H48,1,0)","v":1},{"$f":"G49*L49*M49","v":0},{"$f":"IF($J47<=H49,1,0)","v":0},{"$f":"N49+M49*O49*(G48-G49)*(H49-$J47)/(H49-H48)","v":0},{"$f":"IF($J47<=I49,1,0)","v":0},{"$f":"IF($J47>I48,1,0)","v":1},0,{"$f":"IF($J47<=I49,1,0)","v":0}]
[null,null,null,null,null,null,70,{"$f":"3290-0.01","v":3289.99},null,null,null,{"$f":"IF($J47<=H50,1,0)","v":0},{"$f":"IF($J47>H49,1,0)","v":1},0,{"$f":"IF($J47<=H50,1,0)","v":0},{"$f":"N50+M50*O50*(G49-G50)*(H50-$J47)/(H50-H49)","v":0},{"$f":"IF($J47<=I50,1,0)","v":0},{"$f":"IF($J47>I49,1,0)","v":1},0,{"$f":"IF($J47<=I50,1,0)","v":0}]
[null,null,null,null,null,null,60,{"$f":"3370-0.01","v":3369.99},null,null,null,{"$f":"IF($J47<=H51,1,0)","v":0},{"$f":"IF($J47>H50,1,0)","v":1},0,{"$f":"IF($J47<=H51,1,0)","v":0},{"$f":"N51+M51*O51*(G50-G51)*(H51-$J47)/(H51-H50)","v":0},{"$f":"IF($J47<=I51,1,0)","v":0},{"$f":"IF($J47>I50,1,0)","v":1},0,{"$f":"IF($J47<=I51,1,0)","v":0}]
[null,null,null,null,null,null,50,{"$f":"3450-0.01","v":3449.99},null,null,null,{"$f":"IF($J47<=H52,1,0)","v":0},{"$f":"IF($J47>H51,1,0)","v":1},0,{"$f":"IF($J47<=H52,1,0)","v":0},{"$f":"N52+M52*O52*(G51-G52)*(H52-$J47)/(H52-H51)","v":0},{"$f":"IF($J47<=I52,1,0)","v":0},{"$f":"IF($J47>I51,1,0)","v":1},0,{"$f":"IF($J47<=I52,1,0)","v":0}]
[null,null,null,null,null,null,40,{"$f":"3550-0.01","v":3549.99},null,null,null,{"$f":"IF($J47<=H53,1,0)","v":0},{"$f":"IF($J47>H52,1,0)","v":1},0,{"$f":"IF($J47<=H53,1,0)","v":0},{"$f":"N53+M53*O53*(G52-G53)*(H53-$J47)/(H53-H52)","v":0},{"$f":"IF($J47<=I53,1,0)","v":0},{"$f":"IF($J47>I52,1,0)","v":1},0,{"$f":"IF($J47<=I53,1,0)","v":0}]
[null,null,null,null,null,null,30,{"$f":"3650-0.01","v":3649.99},null,null,null,{"$f":"IF($J47<=H54,1,0)","v":0},{"$f":"IF($J47>H53,1,0)","v":1},0,{"$f":"IF($J47<=H54,1,0)","v":0},{"$f":"N54+M54*O54*(G53-G54)*(H54-$J47)/(H54-H53)","v":0},{"$f":"IF($J47<=I54,1,0)","v":0},{"$f":"IF($J47>I53,1,0)","v":1},0,{"$f":"IF($J47<=I54,1,0)","v":0}]
[null,null,null,null,null,null,20,{"$f":"3750-0.01","v":3749.99},null,null,null,{"$f":"IF($J47<=H55,1,0)","v":0},{"$f":"IF($J47>H54,1,0)","v":1},0,{"$f":"IF($J47<=H55,1,0)","v":0},{"$f":"N55+M55*O55*(G54-G55)*(H55-$J47)/(H55-H54)","v":0},{"$f":"IF($J47<=I55,1,0)","v":0},{"$f":"IF($J47>I54,1,0)","v":1},0,{"$f":"IF($J47<=I55,1,0)","v":0}]
[null,null,null,null,null,null,10,{"$f":"3850","v":3850},null,null,null,{"$f":"IF($J47>H55,1,0)","v":1},{"$f":"IF($J47>H55,1,0)","v":1},10,{"$f":"IF($J47<H56,1,0)","v":0},{"$f":"N56+M56*O56*(G55-G56)*(H56-$J47)/(H56-H55)","v":10},{"$f":"IF($J47>I55,1,0)","v":1},{"$f":"IF($J47>I55,1,0)","v":1},10,{"$f":"IF($J47<I56,1,0)","v":0}]
[null,null,null,null,null,null,0,"Kein Nachweis","Kein Nachweis",null,null,null,null,null,null,0]
[null,null,null,null,null,null,null,null,null,null,null,null,null,null,null,{"$f":"SUM(P47:P57)","v":10},null,null,null,null,{"$f":"SUM(U47:U57)","v":0}]

{"sheet":"Bauteilkostenübersicht","index":2,"n_rows":224,"n_cols":5,"rows_kept":224,"cut":false,"hidden":false,"merged":[[1,2,1,4],[2,2,2,4]]}
[]
[null,"Projekt:",{"$f":"IF(ISTEXT(Projekt),Projekt,\"\")","v":"Beispieleingabe\n\n(Szenario: 10 Mio Euro netto Herstellungskosten für KG 300 und 400)\n"}]
[null,"Stand:",{"$f":"IF(ISNUMBER(LCC_Stand),LCC_Stand,\"\")","v":"2018-01-08"}]
[null,"Bauwerkskosten (Summe KG 300 und 400)",null,{"$f":"D7+D76","v":10000000},{"$f":"E7+E76","v":11900000}]
[]
[null,"Kostengruppen (KG)  nach DIN 276",null,"in EURO netto","in EURO brutto"]
[null,300,"Bauwerk - Baukonstruktionen",{"$f":"D8+D9+D15+D25+D36+D45+D51+D58+D63","v":7160000},{"$f":"E8+E9+E15+E25+E36+E45+E51+E58+E63","v":8520400}]
[null,300,"Bauwerk - Baukonstruktionen - Eingaben 1. Ebene",{"$f":"SUMIF(Bauteile!$E$11:$J$43,$B8,Bauteile!$J$11:$J$43)","v":0},{"$f":"ROUND(D8*1.19,2)","v":0}]
[null,310,"Baugrube",{"$f":"SUM(D10:D14)","v":87000},{"$f":"SUM(E10:E14)","v":103530}]
[null,310,"Baugrube - Eingaben 2. Ebene",{"$f":"SUMIF(Bauteile!$E$11:$J$43,$B10,Bauteile!$J$11:$J$43)","v":87000},{"$f":"ROUND(D10*1.19,2)","v":103530}]
[null,311,"Baugrubenherstellung",{"$f":"SUMIF(Bauteile!$E$11:$J$43,$B11,Bauteile!$J$11:$J$43)","v":0},{"$f":"ROUND(D11*1.19,2)","v":0}]
[null,312,"Baugrubenumschließung",{"$f":"SUMIF(Bauteile!$E$11:$J$43,$B12,Bauteile!$J$11:$J$43)","v":0},{"$f":"ROUND(D12*1.19,2)","v":0}]
[null,313,"Wasserhaltung",{"$f":"SUMIF(Bauteile!$E$11:$J$43,$B13,Bauteile!$J$11:$J$43)","v":0},0]
[null,319,"Baugrube, Sonstiges",{"$f":"SUMIF(Bauteile!$E$11:$J$43,$B14,Bauteile!$J$11:$J$43)","v":0},0]
[null,320,"Gründung",{"$f":"SUM(D16:D24)","v":293000},{"$f":"SUM(E16:E24)","v":348670}]
[null,320,"Gründung - Eingaben 2. Ebene",{"$f":"SUMIF(Bauteile!$E$11:$J$43,$B16,Bauteile!$J$11:$J$43)","v":293000},{"$f":"ROUND(D16*1.19,2)","v":348670}]
[null,321,"Baugrundverbesserung",{"$f":"SUMIF(Bauteile!$E$11:$J$43,$B17,Bauteile!$J$11:$J$43)","v":0},{"$f":"ROUND(D17*1.19,2)","v":0}]
[null,322,"Flachgründungen",{"$f":"SUMIF(Bauteile!$E$11:$J$43,$B18,Bauteile!$J$11:$J$43)","v":0},{"$f":"ROUND(D18*1.19,2)","v":0}]
[null,323,"Tiefgründungen",{"$f":"SUMIF(Bauteile!$E$11:$J$43,$B19,Bauteile!$J$11:$J$43)","v":0},0]
[null,324,"Unterböden und Bodenplatten",{"$f":"SUMIF(Bauteile!$E$11:$J$43,$B20,Bauteile!$J$11:$J$43)","v":0},0]
[null,325,"Bodenbeläge",{"$f":"SUMIF(Bauteile!$E$11:$J$43,$B21,Bauteile!$J$11:$J$43)","v":0},0]
[null,326,"Bauwerksabdichtungen",{"$f":"SUMIF(Bauteile!$E$11:$J$43,$B22,Bauteile!$J$11:$J$43)","v":0},0]
[null,327,"Drainagen",{"$f":"SUMIF(Bauteile!$E$11:$J$43,$B23,Bauteile!$J$11:$J$43)","v":0},0]
[null,329,"Gründungen, Sonstiges",{"$f":"SUMIF(Bauteile!$E$11:$J$43,$B24,Bauteile!$J$11:$J$43)","v":0},0]
[null,330,"Außenwände",{"$f":"SUM(D26:D35)","v":2175000},{"$f":"SUM(E26:E35)","v":2588250}]
[null,330,"Außenwände - Eingaben 2. Ebene",{"$f":"SUMIF(Bauteile!$E$11:$J$43,$B26,Bauteile!$J$11:$J$43)","v":2175000},{"$f":"ROUND(D26*1.19,2)","v":2588250}]
[null,331,"Tragende Außenwände",{"$f":"SUMIF(Bauteile!$E$11:$J$43,$B27,Bauteile!$J$11:$J$43)","v":0},{"$f":"ROUND(D27*1.19,2)","v":0}]
[null,332,"Nichttragende Außenwände",{"$f":"SUMIF(Bauteile!$E$11:$J$43,$B28,Bauteile!$J$11:$J$43)","v":0},{"$f":"ROUND(D28*1.19,2)","v":0}]
[null,333,"Außenstützen",{"$f":"SUMIF(Bauteile!$E$11:$J$43,$B29,Bauteile!$J$11:$J$43)","v":0},0]
[null,334,"Außentüren und -fenster",{"$f":"SUMIF(Bauteile!$E$11:$J$43,$B30,Bauteile!$J$11:$J$43)","v":0},0]
[null,335,"Außenwandbekleidungen außen",{"$f":"SUMIF(Bauteile!$E$11:$J$43,$B31,Bauteile!$J$11:$J$43)","v":0},0]
[null,336,"Außenwandbekleidungen innen",{"$f":"SUMIF(Bauteile!$E$11:$J$43,$B32,Bauteile!$J$11:$J$43)","v":0},0]
[null,337,"Elementierte Außenwände",{"$f":"SUMIF(Bauteile!$E$11:$J$43,$B33,Bauteile!$J$11:$J$43)","v":0},0]
[null,338,"Sonnenschutz",{"$f":"SUMIF(Bauteile!$E$11:$J$43,$B34,Bauteile!$J$11:$J$43)","v":0},0]
[null,339,"Außenwände, Sonstiges",{"$f":"SUMIF(Bauteile!$E$11:$J$43,$B35,Bauteile!$J$11:$J$43)","v":0},0]
[null,340,"Innenwände",{"$f":"SUM(D37:D44)","v":1954000},{"$f":"SUM(E37:E44)","v":2325260}]
[null,340,"Innenwände - Eingaben 2. Ebene",{"$f":"SUMIF(Bauteile!$E$11:$J$43,$B37,Bauteile!$J$11:$J$43)","v":1954000},{"$f":"ROUND(D37*1.19,2)","v":2325260}]
[null,341,"Tragende Innenwände",{"$f":"SUMIF(Bauteile!$E$11:$J$43,$B38,Bauteile!$J$11:$J$43)","v":0},{"$f":"ROUND(D38*1.19,2)","v":0}]
[null,342,"Nichttragende Innenwände",{"$f":"SUMIF(Bauteile!$E$11:$J$43,$B39,Bauteile!$J$11:$J$43)","v":0},{"$f":"ROUND(D39*1.19,2)","v":0}]
[null,343,"Innenstützen",{"$f":"SUMIF(Bauteile!$E$11:$J$43,$B40,Bauteile!$J$11:$J$43)","v":0},0]
[null,344,"Innentüren und -fenster",{"$f":"SUMIF(Bauteile!$E$11:$J$43,$B41,Bauteile!$J$11:$J$43)","v":0},0]
[null,345,"Innenwandbekleidungen",{"$f":"SUMIF(Bauteile!$E$11:$J$43,$B42,Bauteile!$J$11:$J$43)","v":0},0]
[null,346,"Elementierte Innenwände",{"$f":"SUMIF(Bauteile!$E$11:$J$43,$B43,Bauteile!$J$11:$J$43)","v":0},0]
[null,349,"Innenwände, Sonstiges",{"$f":"SUMIF(Bauteile!$E$11:$J$43,$B44,Bauteile!$J$11:$J$43)","v":0},0]
[null,350,"Decken",{"$f":"SUM(D46:D50)","v":1831000},{"$f":"SUM(E46:E50)","v":2178890}]
[null,350,"Decken - Eingaben 2. Ebene",{"$f":"SUMIF(Bauteile!$E$11:$J$43,$B46,Bauteile!$J$11:$J$43)","v":1831000},{"$f":"ROUND(D46*1.19,2)","v":2178890}]
[null,351,"Deckenkonstruktion",{"$f":"SUMIF(Bauteile!$E$11:$J$43,$B47,Bauteile!$J$11:$J$43)","v":0},{"$f":"ROUND(D47*1.19,2)","v":0}]
[null,352,"Deckenbeläge",{"$f":"SUMIF(Bauteile!$E$11:$J$43,$B48,Bauteile!$J$11:$J$43)","v":0},{"$f":"ROUND(D48*1.19,2)","v":0}]
[null,353,"Deckenbekleidungen",{"$f":"SUMIF(Bauteile!$E$11:$J$43,$B49,Bauteile!$J$11:$J$43)","v":0},0]
[null,359,"Decken, Sonstiges",{"$f":"SUMIF(Bauteile!$E$11:$J$43,$B50,Bauteile!$J$11:$J$43)","v":0},0]
[null,360,"Dächer",{"$f":"SUM(D52:D57)","v":305000},{"$f":"SUM(E52:E57)","v":362950}]
[null,360,"Dächer - Eingaben 2. Ebene",{"$f":"SUMIF(Bauteile!$E$11:$J$43,$B52,Bauteile!$J$11:$J$43)","v":305000},{"$f":"ROUND(D52*1.19,2)","v":362950}]
[null,361,"Dachkonstruktionen",{"$f":"SUMIF(Bauteile!$E$11:$J$43,$B53,Bauteile!$J$11:$J$43)","v":0},{"$f":"ROUND(D53*1.19,2)","v":0}]
[null,362,"Dachfenster, Dachöffnungen",{"$f":"SUMIF(Bauteile!$E$11:$J$43,$B54,Bauteile!$J$11:$J$43)","v":0},{"$f":"ROUND(D54*1.19,2)","v":0}]
[null,363,"Dachbeläge",{"$f":"SUMIF(Bauteile!$E$11:$J$43,$B55,Bauteile!$J$11:$J$43)","v":0},0]
[null,364,"Dachbekleidungen - Putz und Bekleidungen",{"$f":"SUMIF(Bauteile!$E$11:$J$43,$B56,Bauteile!$J$11:$J$43)","v":0},0]
[null,369,"Dächer, Sonstiges",{"$f":"SUMIF(Bauteile!$E$11:$J$43,$B57,Bauteile!$J$11:$J$43)","v":0},0]
[null,370,"Baukonstruktive Einbauten",{"$f":"SUM(D59:D62)","v":176000},{"$f":"SUM(E59:E62)","v":209440}]
[null,370,"Baukonstruktive Einbauten - Eingaben 2. Ebene",{"$f":"SUMIF(Bauteile!$E$11:$J$43,$B59,Bauteile!$J$11:$J$43)","v":176000},{"$f":"ROUND(D59*1.19,2)","v":209440}]
[null,371,"Allgemeine Einbauten",{"$f":"SUMIF(Bauteile!$E$11:$J$43,$B60,Bauteile!$J$11:$J$43)","v":0},{"$f":"ROUND(D60*1.19,2)","v":0}]
[null,372,"Besondere Einbauten",{"$f":"SUMIF(Bauteile!$E$11:$J$43,$B61,Bauteile!$J$11:$J$43)","v":0},{"$f":"ROUND(D61*1.19,2)","v":0}]
[null,379,"Baukonstruktive Einbauten, Sonstiges",{"$f":"SUMIF(Bauteile!$E$11:$J$43,$B62,Bauteile!$J$11:$J$43)","v":0},0]
[null,390,"Sonstige Maßnahmen für Baukonstruktionen",{"$f":"SUM(D64:D73)","v":339000},{"$f":"SUM(E64:E73)","v":403410}]
[null,390,"Sonstige Maßnahmen für Baukonstruktionen - Eingaben 2. Ebene",{"$f":"SUMIF(Bauteile!$E$11:$J$43,$B64,Bauteile!$J$11:$J$43)","v":339000},{"$f":"ROUND(D64*1.19,2)","v":403410}]
[null,391,"Baustelleneinrichtung",{"$f":"SUMIF(Bauteile!$E$11:$J$43,$B65,Bauteile!$J$11:$J$43)","v":0},{"$f":"ROUND(D65*1.19,2)","v":0}]
[null,392,"Gerüste",{"$f":"SUMIF(Bauteile!$E$11:$J$43,$B66,Bauteile!$J$11:$J$43)","v":0},{"$f":"ROUND(D66*1.19,2)","v":0}]
[null,393,"Sicherungsmaßnahmen",{"$f":"SUMIF(Bauteile!$E$11:$J$43,$B67,Bauteile!$J$11:$J$43)","v":0},0]
[null,394,"Abbruchmaßnahmen",{"$f":"SUMIF(Bauteile!$E$11:$J$43,$B68,Bauteile!$J$11:$J$43)","v":0},0]
[null,395,"Instandsetzungen",{"$f":"SUMIF(Bauteile!$E$11:$J$43,$B69,Bauteile!$J$11:$J$43)","v":0},0]
[null,396,"Materialentsorgung",{"$f":"SUMIF(Bauteile!$E$11:$J$43,$B70,Bauteile!$J$11:$J$43)","v":0},0]
[null,397,"Zusätzliche Maßnahmen",{"$f":"SUMIF(Bauteile!$E$11:$J$43,$B71,Bauteile!$J$11:$J$43)","v":0},0]
[null,398,"Provisorische Baukonstruktionen",{"$f":"SUMIF(Bauteile!$E$11:$J$43,$B72,Bauteile!$J$11:$J$43)","v":0},0]
[null,399,"Sonstige Maßnahmen für Baukonstruktionen, Sonstiges",{"$f":"SUMIF(Bauteile!$E$11:$J$43,$B73,Bauteile!$J$11:$J$43)","v":0},0]
[]
[null,"Kostengruppen (KG)  nach DIN 276",null,"in EURO netto","in EURO brutto"]
[null,400,"Bauwerk - Technische Anlagen",{"$f":"D77+D78+D84+D90+D97+D106+D116+D124+D135+D143","v":2840000},{"$f":"E77+E78+E84+E90+E97+E106+E116+E124+E135+E143","v":3379600}]
[null,400,"Bauwerk - Technische Anlagen - Eingaben 1. Ebene",{"$f":"SUMIF(Bauteile!$E$11:$J$43,$B77,Bauteile!$J$11:$J$43)","v":0},{"$f":"ROUND(D77*1.19,2)","v":0}]
[null,410,"Abwasser-, Wasser-, Gasanlagen",{"$f":"SUM(D79:D83)","v":359000},{"$f":"SUM(E79:E83)","v":427210}]
[null,410,"Abwasser-, Wasser-, Gasanlagen - Eingaben 2. Ebene",{"$f":"SUMIF(Bauteile!$E$11:$J$43,$B79,Bauteile!$J$11:$J$43)","v":359000},{"$f":"ROUND(D79*1.19,2)","v":427210}]
[null,411,"Abwasseranlagen",{"$f":"SUMIF(Bauteile!$E$11:$J$43,$B80,Bauteile!$J$11:$J$43)","v":0},{"$f":"ROUND(D80*1.19,2)","v":0}]
[null,412,"Wasseranlagen",{"$f":"SUMIF(Bauteile!$E$11:$J$43,$B81,Bauteile!$J$11:$J$43)","v":0},{"$f":"ROUND(D81*1.19,2)","v":0}]
[null,413,"Gasanlagen",{"$f":"SUMIF(Bauteile!$E$11:$J$43,$B82,Bauteile!$J$11:$J$43)","v":0},0]
[null,419,"Abwasser-, Wasser-, Gasanlagen, Sonstiges",{"$f":"SUMIF(Bauteile!$E$11:$J$43,$B83,Bauteile!$J$11:$J$43)","v":0},0]
[null,420,"Wärmeversorgungsanlagen",{"$f":"SUM(D85:D89)","v":488000},{"$f":"SUM(E85:E89)","v":580720}]
[null,420,"Wärmeversorgungsanlagen - Eingaben 2. Ebene",{"$f":"SUMIF(Bauteile!$E$11:$J$43,$B85,Bauteile!$J$11:$J$43)","v":488000},{"$f":"ROUND(D85*1.19,2)","v":580720}]
[null,421,"Wärmeerzeugungsanlagen",{"$f":"SUMIF(Bauteile!$E$11:$J$43,$B86,Bauteile!$J$11:$J$43)","v":0},{"$f":"ROUND(D86*1.19,2)","v":0}]
[null,422,"Wärmeverteilnetze",{"$f":"SUMIF(Bauteile!$E$11:$J$43,$B87,Bauteile!$J$11:$J$43)","v":0},{"$f":"ROUND(D87*1.19,2)","v":0}]
[null,423,"Raumheizflächen",{"$f":"SUMIF(Bauteile!$E$11:$J$43,$B88,Bauteile!$J$11:$J$43)","v":0},0]
[null,429,"Wärmeversorgungsanlagen, Sonstiges",{"$f":"SUMIF(Bauteile!$E$11:$J$43,$B89,Bauteile!$J$11:$J$43)","v":0},0]
[null,430,"Lufttechnische Anlagen",{"$f":"SUM(D91:D96)","v":285000},{"$f":"SUM(E91:E96)","v":339150}]
[null,430,"Lufttechnische Anlagen - Eingaben 2. Ebene",{"$f":"SUMIF(Bauteile!$E$11:$J$43,$B91,Bauteile!$J$11:$J$43)","v":285000},{"$f":"ROUND(D91*1.19,2)","v":339150}]
[null,431,"Lüftungsanlagen",{"$f":"SUMIF(Bauteile!$E$11:$J$43,$B92,Bauteile!$J$11:$J$43)","v":0},{"$f":"ROUND(D92*1.19,2)","v":0}]
[null,432,"Teilklimaanlagen",{"$f":"SUMIF(Bauteile!$E$11:$J$43,$B93,Bauteile!$J$11:$J$43)","v":0},{"$f":"ROUND(D93*1.19,2)","v":0}]
[null,433,"Klimaanlagen",{"$f":"SUMIF(Bauteile!$E$11:$J$43,$B94,Bauteile!$J$11:$J$43)","v":0},0]
[null,434,"Kälteanlagen",{"$f":"SUMIF(Bauteile!$E$11:$J$43,$B95,Bauteile!$J$11:$J$43)","v":0},0]
[null,439,"Lufttechnische Anlagen, Sonstiges",{"$f":"SUMIF(Bauteile!$E$11:$J$43,$B96,Bauteile!$J$11:$J$43)","v":0},0]
[null,440,"Starkstromanlagen",{"$f":"SUM(D98:D105)","v":766000},{"$f":"SUM(E98:E105)","v":911540}]
[null,440,"Starkstromanlagen - Eingaben 2. Ebene",{"$f":"SUMIF(Bauteile!$E$11:$J$43,$B98,Bauteile!$J$11:$J$43)","v":766000},{"$f":"ROUND(D98*1.19,2)","v":911540}]
[null,441,"Hoch- und Mittelspannungsanlagen",{"$f":"SUMIF(Bauteile!$E$11:$J$43,$B99,Bauteile!$J$11:$J$43)","v":0},{"$f":"ROUND(D99*1.19,2)","v":0}]
[null,442,"Eigenstromversorgungsanlagen",{"$f":"SUMIF(Bauteile!$E$11:$J$43,$B100,Bauteile!$J$11:$J$43)","v":0},{"$f":"ROUND(D100*1.19,2)","v":0}]
[null,443,"Niederspannungsschaltanlagen",{"$f":"SUMIF(Bauteile!$E$11:$J$43,$B101,Bauteile!$J$11:$J$43)","v":0},0]
[null,444,"Niederspannungsinstallationsanlagen",{"$f":"SUMIF(Bauteile!$E$11:$J$43,$B102,Bauteile!$J$11:$J$43)","v":0},0]
[null,445,"Beleuchtungsanlagen",{"$f":"SUMIF(Bauteile!$E$11:$J$43,$B103,Bauteile!$J$11:$J$43)","v":0},0]
[null,446,"Blitzschutz- und Erdungsanlagen",{"$f":"SUMIF(Bauteile!$E$11:$J$43,$B104,Bauteile!$J$11:$J$43)","v":0},0]
[null,449,"Starkstromanlagen, Sonstiges",{"$f":"SUMIF(Bauteile!$E$11:$J$43,$B105,Bauteile!$J$11:$J$43)","v":0},0]
[null,450,"Fernmelde- und informationstechnische Anlagen",{"$f":"SUM(D107:D115)","v":271000},{"$f":"SUM(E107:E115)","v":322490}]
[null,450,"Telekommunikationsanlagen - Eingaben 2. Ebene",{"$f":"SUMIF(Bauteile!$E$11:$J$43,$B107,Bauteile!$J$11:$J$43)","v":271000},{"$f":"ROUND(D107*1.19,2)","v":322490}]
[null,451,"Telekommunikationsanlagen",{"$f":"SUMIF(Bauteile!$E$11:$J$43,$B108,Bauteile!$J$11:$J$43)","v":0},{"$f":"ROUND(D108*1.19,2)","v":0}]
[null,452,"Such- und Signalanlagen",{"$f":"SUMIF(Bauteile!$E$11:$J$43,$B109,Bauteile!$J$11:$J$43)","v":0},{"$f":"ROUND(D109*1.19,2)","v":0}]
[null,453,"Zeitdienstanlagen",{"$f":"SUMIF(Bauteile!$E$11:$J$43,$B110,Bauteile!$J$11:$J$43)","v":0},0]
[null,454,"Elektroakustische Anlagen",{"$f":"SUMIF(Bauteile!$E$11:$J$43,$B111,Bauteile!$J$11:$J$43)","v":0},0]
[null,455,"Fernseh- und Antennenanlagen",{"$f":"SUMIF(Bauteile!$E$11:$J$43,$B112,Bauteile!$J$11:$J$43)","v":0},0]
[null,456,"Gefahrenmelde- und Alarmanlagen",{"$f":"SUMIF(Bauteile!$E$11:$J$43,$B113,Bauteile!$J$11:$J$43)","v":0},0]
[null,457,"Übertragungsnetze",{"$f":"SUMIF(Bauteile!$E$11:$J$43,$B114,Bauteile!$J$11:$J$43)","v":0},0]
[null,459,"Fernmelde- und informationstechnische Anlagen, Sonst.",{"$f":"SUMIF(Bauteile!$E$11:$J$43,$B115,Bauteile!$J$11:$J$43)","v":0},0]
[null,460,"Förderanlagen",{"$f":"SUM(D117:D123)","v":197000},{"$f":"SUM(E117:E123)","v":234430}]
[null,460,"Förderanlagen - Eingaben 2. Ebene",{"$f":"SUMIF(Bauteile!$E$11:$J$43,$B117,Bauteile!$J$11:$J$43)","v":197000},{"$f":"ROUND(D117*1.19,2)","v":234430}]
[null,461,"Aufzugsanlagen",{"$f":"SUMIF(Bauteile!$E$11:$J$43,$B118,Bauteile!$J$11:$J$43)","v":0},{"$f":"ROUND(D118*1.19,2)","v":0}]
[null,462,"Fahrtreppen, Fahrsteige",{"$f":"SUMIF(Bauteile!$E$11:$J$43,$B119,Bauteile!$J$11:$J$43)","v":0},{"$f":"ROUND(D119*1.19,2)","v":0}]
[null,463,"Befahranlagen",{"$f":"SUMIF(Bauteile!$E$11:$J$43,$B120,Bauteile!$J$11:$J$43)","v":0},0]
[null,464,"Transportanlagen",{"$f":"SUMIF(Bauteile!$E$11:$J$43,$B121,Bauteile!$J$11:$J$43)","v":0},0]
[null,465,"Krananlagen",{"$f":"SUMIF(Bauteile!$E$11:$J$43,$B122,Bauteile!$J$11:$J$43)","v":0},0]
[null,469,"Förderanlagen, Sonstiges",{"$f":"SUMIF(Bauteile!$E$11:$J$43,$B123,Bauteile!$J$11:$J$43)","v":0},0]
[null,470,"Nutzungsspezifische Anlagen",{"$f":"SUM(D125:D134)","v":142000},{"$f":"SUM(E125:E134)","v":168980}]
[null,470,"Nutzungsspezifische Anlagen - Eingaben 2. Ebene",{"$f":"SUMIF(Bauteile!$E$11:$J$43,$B125,Bauteile!$J$11:$J$43)","v":142000},{"$f":"ROUND(D125*1.19,2)","v":168980}]
[null,471,"Küchentechnische Anlagen",{"$f":"SUMIF(Bauteile!$E$11:$J$43,$B126,Bauteile!$J$11:$J$43)","v":0},{"$f":"ROUND(D126*1.19,2)","v":0}]
[null,472,"Wäscherei- und Reinigungsanlagen",{"$f":"SUMIF(Bauteile!$E$11:$J$43,$B127,Bauteile!$J$11:$J$43)","v":0},{"$f":"ROUND(D127*1.19,2)","v":0}]
[null,473,"Medienversorgungsanlagen",{"$f":"SUMIF(Bauteile!$E$11:$J$43,$B128,Bauteile!$J$11:$J$43)","v":0},0]
[null,474,"Medizin- und labortechnische Anlagen",{"$f":"SUMIF(Bauteile!$E$11:$J$43,$B129,Bauteile!$J$11:$J$43)","v":0},0]
[null,475,"Feuerlöschanlagen",{"$f":"SUMIF(Bauteile!$E$11:$J$43,$B130,Bauteile!$J$11:$J$43)","v":0},0]
[null,476,"Badetechnische Anlagen",{"$f":"SUMIF(Bauteile!$E$11:$J$43,$B131,Bauteile!$J$11:$J$43)","v":0},0]
[null,477,"Prozesswärme-, kälte-, und luftanlagen",{"$f":"SUMIF(Bauteile!$E$11:$J$43,$B132,Bauteile!$J$11:$J$43)","v":0},0]
[null,478,"Entsorgungsanlagen",{"$f":"SUMIF(Bauteile!$E$11:$J$43,$B133,Bauteile!$J$11:$J$43)","v":0},0]
[null,479,"Nutzungsspezifische Anlagen, Sonstiges",{"$f":"SUMIF(Bauteile!$E$11:$J$43,$B134,Bauteile!$J$11:$J$43)","v":0},0]
[null,480,"Gebäudeautomation",{"$f":"SUM(D136:D142)","v":264000},{"$f":"SUM(E136:E142)","v":314160}]
[null,480,"Gebäudeautomation - Eingaben 2. Ebene",{"$f":"SUMIF(Bauteile!$E$11:$J$43,$B136,Bauteile!$J$11:$J$43)","v":264000},{"$f":"ROUND(D136*1.19,2)","v":314160}]
[null,481,"Automationssysteme",{"$f":"SUMIF(Bauteile!$E$11:$J$43,$B137,Bauteile!$J$11:$J$43)","v":0},{"$f":"ROUND(D137*1.19,2)","v":0}]
[null,482,"Schaltschränke",{"$f":"SUMIF(Bauteile!$E$11:$J$43,$B138,Bauteile!$J$11:$J$43)","v":0},{"$f":"ROUND(D138*1.19,2)","v":0}]
[null,483,"Management- und Bedieneinrichtungen",{"$f":"SUMIF(Bauteile!$E$11:$J$43,$B139,Bauteile!$J$11:$J$43)","v":0},0]
[null,484,"Raumautomationssysteme",{"$f":"SUMIF(Bauteile!$E$11:$J$43,$B140,Bauteile!$J$11:$J$43)","v":0},0]
[null,485,"Übertragungsnetze",{"$f":"SUMIF(Bauteile!$E$11:$J$43,$B141,Bauteile!$J$11:$J$43)","v":0},0]
[null,489,"Gebäudeautomation, Sonstiges",{"$f":"SUMIF(Bauteile!$E$11:$J$43,$B142,Bauteile!$J$11:$J$43)","v":0},0]
[null,490,"Sonstige Maßnahmen für technische Anlagen",{"$f":"SUM(D144:D153)","v":68000},{"$f":"SUM(E144:E153)","v":80920}]
[null,490,"Sonstige Maßnahmen für technische Anlagen - Eingaben 2. Ebene",{"$f":"SUMIF(Bauteile!$E$11:$J$43,$B144,Bauteile!$J$11:$J$43)","v":68000},{"$f":"ROUND(D144*1.19,2)","v":80920}]
[null,491,"Baustelleneinrichtung",{"$f":"SUMIF(Bauteile!$E$11:$J$43,$B145,Bauteile!$J$11:$J$43)","v":0},{"$f":"ROUND(D145*1.19,2)","v":0}]
[null,492,"Gerüste",{"$f":"SUMIF(Bauteile!$E$11:$J$43,$B146,Bauteile!$J$11:$J$43)","v":0},{"$f":"ROUND(D146*1.19,2)","v":0}]
[null,493,"Sicherungsmaßnahmen",{"$f":"SUMIF(Bauteile!$E$11:$J$43,$B147,Bauteile!$J$11:$J$43)","v":0},0]
[null,494,"Abbruchmaßnahmen",{"$f":"SUMIF(Bauteile!$E$11:$J$43,$B148,Bauteile!$J$11:$J$43)","v":0},0]
[null,495,"Instandsetzungen",{"$f":"SUMIF(Bauteile!$E$11:$J$43,$B149,Bauteile!$J$11:$J$43)","v":0},0]
[null,496,"Materialentsorgung",{"$f":"SUMIF(Bauteile!$E$11:$J$43,$B150,Bauteile!$J$11:$J$43)","v":0},0]
[null,497,"Zusätzliche Maßnahmen",{"$f":"SUMIF(Bauteile!$E$11:$J$43,$B151,Bauteile!$J$11:$J$43)","v":0},0]
[null,498,"Provisorische technische Anlagen",{"$f":"SUMIF(Bauteile!$E$11:$J$43,$B152,Bauteile!$J$11:$J$43)","v":0},0]
[null,499,"Sonstige Maßnahmen für technische Anlagen, Sonst.",{"$f":"SUMIF(Bauteile!$E$11:$J$43,$B153,Bauteile!$J$11:$J$43)","v":0},0]
[]
[null,"Kostengruppen (KG)  nach DIN 276",null,"in EURO netto","in EURO brutto"]
[null,500,"Außenanlagen",{"$f":"D157+D158+D163+D173+D184+D195+D200+D205+D214","v":0},{"$f":"E157+E158+E163+E173+E184+E195+E200+E205+E214","v":0}]
[null,500,"Außenanlagen - Eingaben 1. Ebene",{"$f":"SUMIF(Bauteile!$E$11:$J$43,$B157,Bauteile!$J$11:$J$43)","v":0},{"$f":"ROUND(D157*1.19,2)","v":0}]
[null,510,"Geländeflächen",{"$f":"SUM(D159:D162)","v":0},{"$f":"SUM(E159:E162)","v":0}]
[null,510,"Geländeflächen - Eingaben 2. Ebene",{"$f":"SUMIF(Bauteile!$E$11:$J$43,$B159,Bauteile!$J$11:$J$43)","v":0},{"$f":"ROUND(D159*1.19,2)","v":0}]
[null,511,"Oberbodenarbeiten",{"$f":"SUMIF(Bauteile!$E$11:$J$43,#REF!,Bauteile!$J$11:$J$43)","v":0},{"$f":"ROUND(D160*1.19,2)","v":0}]
[null,512,"Bodenarbeiten",{"$f":"SUMIF(Bauteile!$E$11:$J$43,#REF!,Bauteile!$J$11:$J$43)","v":0},0]
[null,519,"Geländeflächen, sonstiges",{"$f":"SUMIF(Bauteile!$E$11:$J$43,#REF!,Bauteile!$J$11:$J$43)","v":0},0]
[null,520,"Befestigte Flächen",{"$f":"SUM(D164:D172)","v":0},{"$f":"SUM(E164:E172)","v":0}]
[null,520,"Befestigte Flächen - Eingaben 2. Ebene",{"$f":"SUMIF(Bauteile!$E$11:$J$43,$B164,Bauteile!$J$11:$J$43)","v":0},{"$f":"ROUND(D164*1.19,2)","v":0}]
[null,521,"Wege",{"$f":"SUMIF(Bauteile!$E$11:$J$43,$B165,Bauteile!$J$11:$J$43)","v":0},{"$f":"ROUND(D165*1.19,2)","v":0}]
[null,522,"Straßen",{"$f":"SUMIF(Bauteile!$E$11:$J$43,$B166,Bauteile!$J$11:$J$43)","v":0},0]
[null,523,"Plätze, Höfe",{"$f":"SUMIF(Bauteile!$E$11:$J$43,$B167,Bauteile!$J$11:$J$43)","v":0},0]
[null,524,"Stellplätze",{"$f":"SUMIF(Bauteile!$E$11:$J$43,$B168,Bauteile!$J$11:$J$43)","v":0},0]
[null,525,"Sportplatzflächen",{"$f":"SUMIF(Bauteile!$E$11:$J$43,$B169,Bauteile!$J$11:$J$43)","v":0},0]
[null,526,"Spielplatzflächen",{"$f":"SUMIF(Bauteile!$E$11:$J$43,$B170,Bauteile!$J$11:$J$43)","v":0},0]
[null,527,"Gleisanlagen",{"$f":"SUMIF(Bauteile!$E$11:$J$43,$B171,Bauteile!$J$11:$J$43)","v":0},0]
[null,529,"Befestigte Flächen, sonstiges",{"$f":"SUMIF(Bauteile!$E$11:$J$43,$B172,Bauteile!$J$11:$J$43)","v":0},0]
[null,530,"Baukonstruktionen in Außenanlagen",{"$f":"SUM(D174:D183)","v":0},{"$f":"SUM(E174:E183)","v":0}]
[null,530,"Baukonstruktionen in Außenanlagen - Eingaben 2. Ebene",{"$f":"SUMIF(Bauteile!$E$11:$J$43,$B174,Bauteile!$J$11:$J$43)","v":0},{"$f":"ROUND(D174*1.19,2)","v":0}]
[null,531,"Einfriedungen",{"$f":"SUMIF(Bauteile!$E$11:$J$43,$B175,Bauteile!$J$11:$J$43)","v":0},{"$f":"ROUND(D175*1.19,2)","v":0}]
[null,532,"Schutzkonstruktionen",{"$f":"SUMIF(Bauteile!$E$11:$J$43,$B176,Bauteile!$J$11:$J$43)","v":0},0]
[null,533,"Mauern, Wände",{"$f":"SUMIF(Bauteile!$E$11:$J$43,$B177,Bauteile!$J$11:$J$43)","v":0},0]
[null,534,"Rampen, Treppen, Tribünen",{"$f":"SUMIF(Bauteile!$E$11:$J$43,$B178,Bauteile!$J$11:$J$43)","v":0},0]
[null,535,"Überdachungen",{"$f":"SUMIF(Bauteile!$E$11:$J$43,$B179,Bauteile!$J$11:$J$43)","v":0},0]
[null,536,"Brücken, Stege",{"$f":"SUMIF(Bauteile!$E$11:$J$43,$B180,Bauteile!$J$11:$J$43)","v":0},0]
[null,537,"Kanal- und Schachtbauanlagen",{"$f":"SUMIF(Bauteile!$E$11:$J$43,$B181,Bauteile!$J$11:$J$43)","v":0},0]
[null,538,"Wasserbauliche Anlagen",{"$f":"SUMIF(Bauteile!$E$11:$J$43,$B182,Bauteile!$J$11:$J$43)","v":0},0]
[null,539,"Baukonstruktionen in Außenanlagen, sonstiges",{"$f":"SUMIF(Bauteile!$E$11:$J$43,$B183,Bauteile!$J$11:$J$43)","v":0},0]
[null,540,"Technische Anlagen in Außenanlagen",{"$f":"SUM(D185:D194)","v":0},{"$f":"SUM(E185:E194)","v":0}]
[null,540,"Technische Anlagen in Außenanlagen - Eingaben 2. Ebene",{"$f":"SUMIF(Bauteile!$E$11:$J$43,$B185,Bauteile!$J$11:$J$43)","v":0},{"$f":"ROUND(D185*1.19,2)","v":0}]
[null,541,"Abwasseranlagen",{"$f":"SUMIF(Bauteile!$E$11:$J$43,$B186,Bauteile!$J$11:$J$43)","v":0},{"$f":"ROUND(D186*1.19,2)","v":0}]
[null,542,"Wasseranlagen",{"$f":"SUMIF(Bauteile!$E$11:$J$43,$B187,Bauteile!$J$11:$J$43)","v":0},0]
[null,543,"Gasanlagen",{"$f":"SUMIF(Bauteile!$E$11:$J$43,$B188,Bauteile!$J$11:$J$43)","v":0},0]
[null,544,"Wärmeversorgungsanlagen",{"$f":"SUMIF(Bauteile!$E$11:$J$43,$B189,Bauteile!$J$11:$J$43)","v":0},0]
[null,545,"Lufttechnische Anlagen",{"$f":"SUMIF(Bauteile!$E$11:$J$43,$B190,Bauteile!$J$11:$J$43)","v":0},0]
[null,546,"Starkstromanlagen",{"$f":"SUMIF(Bauteile!$E$11:$J$43,$B191,Bauteile!$J$11:$J$43)","v":0},0]
[null,547,"Fernmelde- und informationstechnische Anlagen",{"$f":"SUMIF(Bauteile!$E$11:$J$43,$B192,Bauteile!$J$11:$J$43)","v":0},0]
[null,548,"Nutzungsspezifische Anlagen",{"$f":"SUMIF(Bauteile!$E$11:$J$43,$B193,Bauteile!$J$11:$J$43)","v":0},0]
[null,549,"Technische Anlagen in Außenanlagen, sonstiges",{"$f":"SUMIF(Bauteile!$E$11:$J$43,$B194,Bauteile!$J$11:$J$43)","v":0},0]
[null,550,"Einbauten in Außenanlagen",{"$f":"SUM(D196:D199)","v":0},{"$f":"SUM(E196:E199)","v":0}]
[null,550,"Einbauten in Außenanlagen - Eingaben 2. Ebene",{"$f":"SUMIF(Bauteile!$E$11:$J$43,$B196,Bauteile!$J$11:$J$43)","v":0},{"$f":"ROUND(D196*1.19,2)","v":0}]
[null,551,"Allgemeine Einbauten",{"$f":"SUMIF(Bauteile!$E$11:$J$43,$B197,Bauteile!$J$11:$J$43)","v":0},{"$f":"ROUND(D197*1.19,2)","v":0}]
[null,552,"Besondere Einbauten",{"$f":"SUMIF(Bauteile!$E$11:$J$43,$B198,Bauteile!$J$11:$J$43)","v":0},0]
[null,559,"Einbauten in Außenanlagen, sonstiges",{"$f":"SUMIF(Bauteile!$E$11:$J$43,$B199,Bauteile!$J$11:$J$43)","v":0},0]
[null,560,"Wasserflächen",{"$f":"SUM(D201:D204)","v":0},{"$f":"SUM(E201:E204)","v":0}]
[null,560,"Wasserflächen - Eingaben 2. Ebene",{"$f":"SUMIF(Bauteile!$E$11:$J$43,$B201,Bauteile!$J$11:$J$43)","v":0},{"$f":"ROUND(D201*1.19,2)","v":0}]
[null,561,"Abdichtungen",{"$f":"SUMIF(Bauteile!$E$11:$J$43,$B202,Bauteile!$J$11:$J$43)","v":0},{"$f":"ROUND(D202*1.19,2)","v":0}]
[null,562,"Bepflanzungen",{"$f":"SUMIF(Bauteile!$E$11:$J$43,$B203,Bauteile!$J$11:$J$43)","v":0},0]
[null,569,"Wasserflächen, sonstiges",{"$f":"SUMIF(Bauteile!$E$11:$J$43,$B204,Bauteile!$J$11:$J$43)","v":0},0]
[null,570,"Pflanz- und Saatflächen",{"$f":"SUM(D206:D213)","v":0},{"$f":"SUM(E206:E213)","v":0}]
[null,570,"Pflanz- und Saatflächen - Eingaben 2. Ebene",{"$f":"SUMIF(Bauteile!$E$11:$J$43,$B206,Bauteile!$J$11:$J$43)","v":0},{"$f":"ROUND(D206*1.19,2)","v":0}]
[null,571,"Oberbodenarbeiten",{"$f":"SUMIF(Bauteile!$E$11:$J$43,$B207,Bauteile!$J$11:$J$43)","v":0},{"$f":"ROUND(D207*1.19,2)","v":0}]
[null,572,"Vegetationstechnische Bodenbearbeitung",{"$f":"SUMIF(Bauteile!$E$11:$J$43,$B208,Bauteile!$J$11:$J$43)","v":0},0]
[null,573,"Sicherungsbauweisen",{"$f":"SUMIF(Bauteile!$E$11:$J$43,$B209,Bauteile!$J$11:$J$43)","v":0},0]
[null,574,"Pflanzen",{"$f":"SUMIF(Bauteile!$E$11:$J$43,$B210,Bauteile!$J$11:$J$43)","v":0},0]
[null,575,"Rasen und Ansaaten",{"$f":"SUMIF(Bauteile!$E$11:$J$43,$B211,Bauteile!$J$11:$J$43)","v":0},0]
[null,576,"Begrünung unterbauter Flächen",{"$f":"SUMIF(Bauteile!$E$11:$J$43,$B212,Bauteile!$J$11:$J$43)","v":0},0]
[null,579,"Pflanz- und Saatflächen, sonstiges",{"$f":"SUMIF(Bauteile!$E$11:$J$43,$B213,Bauteile!$J$11:$J$43)","v":0},0]
[null,590,"Sonstige Außenanlagen",{"$f":"SUM(D215:D224)","v":0},{"$f":"SUM(E215:E224)","v":0}]
[null,590,"Sonstige Außenanlagen - Eingaben 2. Ebene",{"$f":"SUMIF(Bauteile!$E$11:$J$43,$B215,Bauteile!$J$11:$J$43)","v":0},{"$f":"ROUND(D215*1.19,2)","v":0}]
[null,591,"Baustelleneinrichtung",{"$f":"SUMIF(Bauteile!$E$11:$J$43,$B216,Bauteile!$J$11:$J$43)","v":0},{"$f":"ROUND(D216*1.19,2)","v":0}]
[null,592,"Gerüste",{"$f":"SUMIF(Bauteile!$E$11:$J$43,$B217,Bauteile!$J$11:$J$43)","v":0},0]
[null,593,"Sicherungsmaßnahmen",{"$f":"SUMIF(Bauteile!$E$11:$J$43,$B218,Bauteile!$J$11:$J$43)","v":0},0]
[null,594,"Abbruchmaßnahmen",{"$f":"SUMIF(Bauteile!$E$11:$J$43,$B219,Bauteile!$J$11:$J$43)","v":0},0]
[null,595,"Instandsetzungen",{"$f":"SUMIF(Bauteile!$E$11:$J$43,$B220,Bauteile!$J$11:$J$43)","v":0},0]
[null,596,"Materialentsorgung",{"$f":"SUMIF(Bauteile!$E$11:$J$43,$B221,Bauteile!$J$11:$J$43)","v":0},0]
[null,597,"Zusätzliche Maßnahmen",{"$f":"SUMIF(Bauteile!$E$11:$J$43,$B222,Bauteile!$J$11:$J$43)","v":0},0]
[null,598,"Provisorische Außenanlagen",{"$f":"SUMIF(Bauteile!$E$11:$J$43,$B223,Bauteile!$J$11:$J$43)","v":0},0]
[null,599,"Sonstige Maßnahmen für Außenanlagen, sonstiges",{"$f":"SUMIF(Bauteile!$E$11:$J$43,$B224,Bauteile!$J$11:$J$43)","v":0},0]

{"sheet":"Bauteile","index":3,"n_rows":43,"n_cols":782,"rows_kept":43,"cut":false,"hidden":false,"merged":[[4,35,4,46],[5,44,5,46],[5,32,5,34],[5,26,5,27],[5,41,5,43],[5,35,5,37],[5,38,5,40],[5,29,5,31],[4,28,4,34],[4,25,4,27],[1,2,1,4],[2,2,2,4],[0,0,0,2],[4,0,4,2],[5,23,5,24],[5,4,5,5],[4,9,4,14],[5,18,5,20],[5,10,5,11],[4,18,4,24],[4,4,4,8],[5,6,5,7],[4,15,4,17]]}
["Berechnung LCC nach BNB BN 2.1.1 v2015\nEingabe Bauteile",null,null,null,"BBR-LCC\nVer. 15-1\nBBR A1"]
["Projekt:",null,{"$f":"IF(ISTEXT(Projekt),Projekt,\"\")","v":"Beispieleingabe\n\n(Szenario: 10 Mio Euro netto Herstellungskosten für KG 300 und 400)\n"}]
["Stand:",null,{"$f":"IF(ISNUMBER(LCC_Stand),LCC_Stand,\"\")","v":"2018-01-08"}]
[]
["Bauteil",null,null,null,"Grunddaten",null,null,null,null,"Herstellkosten",null,null,null,null,null,"Sonderbedingungen",null,null,"Nutzungsdauer",null,null,null,null,null,null,"regelmäßige Kosten (Kontrolle)",null,null,"regelmäßige Kosten",null,null,null,null,null,null,"Berechnung",null,null,null,null,null,null,null,null,null,null,null,"Barwert","Barwert",null,null,"Barwert","Barwert","Barwert","Barwert","Barwert","Barwert","Barwert","Barwert","Barwert","Barwert","Barwert","Barwert","Barwert","Barwert","Barwert","Barwert","Barwert","Barwert","Barwert","Barwert","Barwert","Barwert","Barwert","Barwert","Barwert","Barwert","Barwert","Barwert","Barwert","Barwert","Barwert","Barwert","Barwert","Barwert","Barwert","Barwert","Barwert","Barwert","Barwert","Barwert","Barwert","Barwert","Barwert","Barwert","Barwert","Barwert","Barwert","Barwert","Barwert","Barwert","Barwert","Barwert","Barwert","Barwert","Barwert","Barwert","Barwert","Barwert","Barwert","Barwert","Barwert","Barwert","Barwert","Barwert","Barwert","Barwert","Barwert","Barwert","Barwert","Barwert","Barwert","Barwert","Barwert","Barwert","Barwert","Barwert","Barwert","Barwert","Barwert","Barwert","Barwert","Barwert","Barwert","Barwert","Barwert","Barwert","Barwert","Barwert","Barwert","Barwert","Barwert","Barwert","Barwert","Barwert","Barwert","Barwert","Barwert","Barwert","Barwert","Barwert","Barwert","Barwert","Barwert","Barwert","Barwert","Barwert","Barwert","Barwert","Barwert","Barwert","Barwert","Barwert","Barwert","Barwert","Barwert","Barwert","Barwert","Barwert","Barwert","Barwert","Barwert","Barwert","Barwert","Barwert","Barwert","Barwert","Barwert","Barwert","Barwert","Barwert","Barwert","Barwert","Barwert","Barwert","Barwert","Barwert","Barwert","Barwert","Barwert","Barwert","Barwert","Barwert","Barwert","Barwert","Barwert","Barwert","Barwert","Barwert","Barwert","Barwert","Barwert","Barwert","Barwert","Barwert","Barwert","Barwert","Barwert","Barwert","Barwert","Barwert","Barwert","Barwert","Barwert","Barwert","Barwert","Barwert","Barwert","Barwert","Barwert","Barwert","Barwert","Barwert","Barwert","Barwert","Barwert","Barwert","Barwert","Barwert","Barwert","Barwert","Barwert","Barwert","Barwert","Barwert","Barwert","Barwert","Barwert","Barwert","Barwert","Barwert","Barwert","Barwert","Barwert","Barwert","Barwert","Barwert","Barwert","Barwert","Barwert","Barwert","Barwert","Barwert","Barwert","Barwert","Barwert","Barwert","Barwert","Barwert","Barwert","Barwert","Barwert","Barwert","Barwert","Barwert","Barwert","Barwert","Barwert","Barwert","Barwert","Barwert","Barwert","Barwert","Barwert","Barwert","Barwert","Barwert","Barwert","Barwert","Barwert","Barwert","Barwert","Barwert","Barwert","Barwert","Barwert","Barwert","Barwert","Barwert","Barwert","Barwert","Barwert","Barwert","Barwert",null,"Barwert","Barwert","Barwert","Barwert","Barwert","Barwert","Barwert","Barwert","Barwert","Barwert","Barwert","Barwert","Barwert","Barwert","Barwert","Barwert","Barwert","Barwert","Barwert","Barwert","Barwert","Barwert","Barwert","Barwert","Barwert","Barwert","Barwert","Barwert","Barwert","Barwert","Barwert","Barwert","Barwert","Barwert","Barwert","Barwert","Barwert","Barwert","Barwert","Barwert","Barwert","Barwert","Barwert","Barwert","Barwert","Barwert","Barwert","Barwert","Barwert","Barwert","Barwert","Barwert","Barwert","Barwert","Barwert","Barwert","Barwert","Barwert","Barwert","Barwert","Barwert","Barwert","Barwert","Barwert","Barwert","Barwert","Barwert","Barwert","Barwert","Barwert","Barwert","Barwert","Barwert","Barwert","Barwert","Barwert","Barwert","Barwert","Barwert","Barwert","Barwert","Barwert","Barwert","Barwert","Barwert","Barwert","Barwert","Barwert","Barwert","Barwert","Barwert","Barwert","Barwert","Barwert","Barwert","Barwert","Barwert","Barwert","Barwert","Barwert","Barwert","Barwert","Barwert","Barwert","Barwert","Barwert","Barwert","Barwert","Barwert","Barwert","Barwert","Barwert","Barwert","Barwert","Barwert","Barwert","Barwert","Barwert","Barwert","Barwert","Barwert","Barwert","Barwert","Barwert","Barwert","Barwert","Barwert","Barwert","Barwert","Barwert","Barwert","Barwert","Barwert","Barwert","Barwert","Barwert","Barwert","Barwert","Barwert","Barwert","Barwert","Barwert","Barwert","Barwert","Barwert","Barwert","Barwert","Barwert","Barwert","Barwert","Barwert","Barwert","Barwert","Barwert","Barwert","Barwert","Barwert","Barwert","Barwert","Barwert","Barwert","Barwert","Barwert","Barwert","Barwert","Barwert","Barwert","Barwert","Barwert","Barwert","Barwert","Barwert","Barwert","Barwert","Barwert","Barwert","Barwert","Barwert","Barwert","Barwert","Barwert","Barwert","Barwert","Barwert","Barwert","Barwert","Barwert","Barwert","Barwert","Barwert","Barwert","Barwert","Barwert","Barwert","Barwert","Barwert","Barwert","Barwert","Barwert","Barwert","Barwert","Barwert","Barwert","Barwert","Barwert","Barwert","Barwert","Barwert","Barwert","Barwert","Barwert","Barwert","Barwert","Barwert","Barwert","Barwert","Barwert","Barwert","Barwert","Barwert","Barwert","Barwert","Barwert","Barwert","Barwert","Barwert","Barwert","Barwert","Barwert","Barwert","Barwert","Barwert","Barwert","Barwert","Barwert","Barwert","Barwert","Barwert","Barwert","Barwert","Barwert","Barwert","Barwert",null,"Barwert","Barwert","Barwert","Barwert","Barwert","Barwert","Barwert","Barwert","Barwert","Barwert","Barwert","Barwert","Barwert","Barwert","Barwert","Barwert","Barwert","Barwert","Barwert","Barwert","Barwert","Barwert","Barwert","Barwert","Barwert","Barwert","Barwert","Barwert","Barwert","Barwert","Barwert","Barwert","Barwert","Barwert","Barwert","Barwert","Barwert","Barwert","Barwert","Barwert","Barwert","Barwert","Barwert","Barwert","Barwert","Barwert","Barwert","Barwert","Barwert","Barwert","Barwert","Barwert","Barwert","Barwert","Barwert","Barwert","Barwert","Barwert","Barwert","Barwert","Barwert","Barwert","Barwert","Barwert","Barwert","Barwert","Barwert","Barwert","Barwert","Barwert","Barwert","Barwert","Barwert","Barwert","Barwert","Barwert","Barwert","Barwert","Barwert","Barwert","Barwert","Barwert","Barwert","Barwert","Barwert","Barwert","Barwert","Barwert","Barwert","Barwert","Barwert","Barwert","Barwert","Barwert","Barwert","Barwert","Barwert","Barwert","Barwert","Barwert","Barwert","Barwert","Barwert","Barwert","Barwert","Barwert","Barwert","Barwert","Barwert","Barwert","Barwert","Barwert","Barwert","Barwert","Barwert","Barwert","Barwert","Barwert","Barwert","Barwert","Barwert","Barwert","Barwert","Barwert","Barwert","Barwert","Barwert","Barwert","Barwert","Barwert","Barwert","Barwert","Barwert","Barwert","Barwert","Barwert","Barwert","Barwert","Barwert","Barwert","Barwert","Barwert","Barwert","Barwert","Barwert","Barwert","Barwert","Barwert","Barwert","Barwert","Barwert","Barwert","Barwert","Barwert","Barwert","Barwert","Barwert","Barwert","Barwert","Barwert","Barwert","Barwert","Barwert","Barwert","Barwert","Barwert","Barwert","Barwert","Barwert","Barwert","Barwert","Barwert","Barwert","Barwert","Barwert","Barwert","Barwert","Barwert","Barwert","Barwert","Barwert","Barwert","Barwert","Barwert","Barwert","Barwert","Barwert","Barwert","Barwert","Barwert","Barwert","Barwert","Barwert","Barwert","Barwert","Barwert","Barwert","Barwert","Barwert","Barwert","Barwert","Barwert","Barwert","Barwert","Barwert","Barwert","Barwert","Barwert","Barwert","Barwert","Barwert","Barwert","Barwert","Barwert","Barwert","Barwert","Barwert","Barwert","Barwert","Barwert","Barwert","Barwert","Barwert","Barwert","Barwert","Barwert","Barwert","Barwert","Barwert","Barwert","Barwert","Barwert","Barwert","Barwert","Barwert","Barwert","Barwert","Barwert","Barwert","Barwert","Barwert","Barwert","Barwert"]
["Nr.","OZ","Bezeichnung","Einbauort","Kostengruppe",null,"Relevanz",null,"Kommentar","GP netto","GP netto\nindiziert für LCC",null,"Menge","Einheit","EP","EP anzusetzende Kosten","GP netto","GP netto\nindiziert für LCC",null,null,null,"Auswahl Datensatz",null,"Handeingabe",null,null,"Absolut",null,"Summe","Auswahl Datensatz",null,null,"Handeingabe",null,null,"Erstherstellung",null,null,"Herstellkosten für Folgekosten",null,null,"Inspektion und Wartung",null,null,"regelmäßige Instandsetzung",null,null,"Gesamt","Gesamt",null,null,"Ersatzinvestitionen","Ersatzinvestitionen","Ersatzinvestitionen","Ersatzinvestitionen","Ersatzinvestitionen","Ersatzinvestitionen","Ersatzinvestitionen","Ersatzinvestitionen","Ersatzinvestitionen","Ersatzinvestitionen","Ersatzinvestitionen","Ersatzinvestitionen","Ersatzinvestitionen","Ersatzinvestitionen","Ersatzinvestitionen","Ersatzinvestitionen","Ersatzinvestitionen","Ersatzinvestitionen","Ersatzinvestitionen","Ersatzinvestitionen","Ersatzinvestitionen","Ersatzinvestitionen","Ersatzinvestitionen","Ersatzinvestitionen","Ersatzinvestitionen","Ersatzinvestitionen","Ersatzinvestitionen","Ersatzinvestitionen","Ersatzinvestitionen","Ersatzinvestitionen","Ersatzinvestitionen","Ersatzinvestitionen","Ersatzinvestitionen","Ersatzinvestitionen","Ersatzinvestitionen","Ersatzinvestitionen","Ersatzinvestitionen","Ersatzinvestitionen","Ersatzinvestitionen","Ersatzinvestitionen","Ersatzinvestitionen","Ersatzinvestitionen","Ersatzinvestitionen","Ersatzinvestitionen","Ersatzinvestitionen","Ersatzinvestitionen","Ersatzinvestitionen","Ersatzinvestitionen","Ersatzinvestitionen","Ersatzinvestitionen","Ersatzinvestitionen","Ersatzinvestitionen","Ersatzinvestitionen","Ersatzinvestitionen","Ersatzinvestitionen","Ersatzinvestitionen","Ersatzinvestitionen","Ersatzinvestitionen","Ersatzinvestitionen","Ersatzinvestitionen","Ersatzinvestitionen","Ersatzinvestitionen","Ersatzinvestitionen","Ersatzinvestitionen","Ersatzinvestitionen","Ersatzinvestitionen","Ersatzinvestitionen","Ersatzinvestitionen","Ersatzinvestitionen","Ersatzinvestitionen","Ersatzinvestitionen","Ersatzinvestitionen","Ersatzinvestitionen","Ersatzinvestitionen","Ersatzinvestitionen","Ersatzinvestitionen","Ersatzinvestitionen","Ersatzinvestitionen","Ersatzinvestitionen","Ersatzinvestitionen","Ersatzinvestitionen","Ersatzinvestitionen","Ersatzinvestitionen","Ersatzinvestitionen","Ersatzinvestitionen","Ersatzinvestitionen","Ersatzinvestitionen","Ersatzinvestitionen","Ersatzinvestitionen","Ersatzinvestitionen","Ersatzinvestitionen","Ersatzinvestitionen","Ersatzinvestitionen","Ersatzinvestitionen","Ersatzinvestitionen","Ersatzinvestitionen","Ersatzinvestitionen","Ersatzinvestitionen","Ersatzinvestitionen","Ersatzinvestitionen","Ersatzinvestitionen","Ersatzinvestitionen","Ersatzinvestitionen","Ersatzinvestitionen","Ersatzinvestitionen","Ersatzinvestitionen","Ersatzinvestitionen","Ersatzinvestitionen","Ersatzinvestitionen","Ersatzinvestitionen","Ersatzinvestitionen","Ersatzinvestitionen","Ersatzinvestitionen","Ersatzinvestitionen","Ersatzinvestitionen","Ersatzinvestitionen","Ersatzinvestitionen","Ersatzinvestitionen","Ersatzinvestitionen","Ersatzinvestitionen","Ersatzinvestitionen","Ersatzinvestitionen","Ersatzinvestitionen","Ersatzinvestitionen","Ersatzinvestitionen","Ersatzinvestitionen","Ersatzinvestitionen","Ersatzinvestitionen","Ersatzinvestitionen","Ersatzinvestitionen","Ersatzinvestitionen","Ersatzinvestitionen","Ersatzinvestitionen","Ersatzinvestitionen","Ersatzinvestitionen","Ersatzinvestitionen","Ersatzinvestitionen","Ersatzinvestitionen","Ersatzinvestitionen","Ersatzinvestitionen","Ersatzinvestitionen","Ersatzinvestitionen","Ersatzinvestitionen","Ersatzinvestitionen","Ersatzinvestitionen","Ersatzinvestitionen","Ersatzinvestitionen","Ersatzinvestitionen","Ersatzinvestitionen","Ersatzinvestitionen","Ersatzinvestitionen","Ersatzinvestitionen","Ersatzinvestitionen","Ersatzinvestitionen","Ersatzinvestitionen","Ersatzinvestitionen","Ersatzinvestitionen","Ersatzinvestitionen","Ersatzinvestitionen","Ersatzinvestitionen","Ersatzinvestitionen","Ersatzinvestitionen","Ersatzinvestitionen","Ersatzinvestitionen","Ersatzinvestitionen","Ersatzinvestitionen","Ersatzinvestitionen","Ersatzinvestitionen","Ersatzinvestitionen","Ersatzinvestitionen","Ersatzinvestitionen","Ersatzinvestitionen","Ersatzinvestitionen","Ersatzinvestitionen","Ersatzinvestitionen","Ersatzinvestitionen","Ersatzinvestitionen","Ersatzinvestitionen","Ersatzinvestitionen","Ersatzinvestitionen","Ersatzinvestitionen","Ersatzinvestitionen","Ersatzinvestitionen","Ersatzinvestitionen","Ersatzinvestitionen","Ersatzinvestitionen","Ersatzinvestitionen","Ersatzinvestitionen","Ersatzinvestitionen","Ersatzinvestitionen","Ersatzinvestitionen","Ersatzinvestitionen","Ersatzinvestitionen","Ersatzinvestitionen","Ersatzinvestitionen","Ersatzinvestitionen","Ersatzinvestitionen","Ersatzinvestitionen","Ersatzinvestitionen","Ersatzinvestitionen","Ersatzinvestitionen","Ersatzinvestitionen","Ersatzinvestitionen","Ersatzinvestitionen","Ersatzinvestitionen","Ersatzinvestitionen","Ersatzinvestitionen","Ersatzinvestitionen","Ersatzinvestitionen","Ersatzinvestitionen","Ersatzinvestitionen","Ersatzinvestitionen","Ersatzinvestitionen","Ersatzinvestitionen","Ersatzinvestitionen","Ersatzinvestitionen","Ersatzinvestitionen","Ersatzinvestitionen","Ersatzinvestitionen","Ersatzinvestitionen","Ersatzinvestitionen","Ersatzinvestitionen","Ersatzinvestitionen","Ersatzinvestitionen","Ersatzinvestitionen","Ersatzinvestitionen","Ersatzinvestitionen","Ersatzinvestitionen","Ersatzinvestitionen","Ersatzinvestitionen","Ersatzinvestitionen","Ersatzinvestitionen","Ersatzinvestitionen","Ersatzinvestitionen","Ersatzinvestitionen","Ersatzinvestitionen","Ersatzinvestitionen","Ersatzinvestitionen","Ersatzinvestitionen","Ersatzinvestitionen","Ersatzinvestitionen","Ersatzinvestitionen","Ersatzinvestitionen",null,"Inspektion und Wartung","Inspektion und Wartung","Inspektion und Wartung","Inspektion und Wartung","Inspektion und Wartung","Inspektion und Wartung","Inspektion und Wartung","Inspektion und Wartung","Inspektion und Wartung","Inspektion und Wartung","Inspektion und Wartung","Inspektion und Wartung","Inspektion und Wartung","Inspektion und Wartung","Inspektion und Wartung","Inspektion und Wartung","Inspektion und Wartung","Inspektion und Wartung","Inspektion und Wartung","Inspektion und Wartung","Inspektion und Wartung","Inspektion und Wartung","Inspektion und Wartung","Inspektion und Wartung","Inspektion und Wartung","Inspektion und Wartung","Inspektion und Wartung","Inspektion und Wartung","Inspektion und Wartung","Inspektion und Wartung","Inspektion und Wartung","Inspektion und Wartung","Inspektion und Wartung","Inspektion und Wartung","Inspektion und Wartung","Inspektion und Wartung","Inspektion und Wartung","Inspektion und Wartung","Inspektion und Wartung","Inspektion und Wartung","Inspektion und Wartung","Inspektion und Wartung","Inspektion und Wartung","Inspektion und Wartung","Inspektion und Wartung","Inspektion und Wartung","Inspektion und Wartung","Inspektion und Wartung","Inspektion und Wartung","Inspektion und Wartung","Inspektion und Wartung","Inspektion und Wartung","Inspektion und Wartung","Inspektion und Wartung","Inspektion und Wartung","Inspektion und Wartung","Inspektion und Wartung","Inspektion und Wartung","Inspektion und Wartung","Inspektion und Wartung","Inspektion und Wartung","Inspektion und Wartung","Inspektion und Wartung","Inspektion und Wartung","Inspektion und Wartung","Inspektion und Wartung","Inspektion und Wartung","Inspektion und Wartung","Inspektion und Wartung","Inspektion und Wartung","Inspektion und Wartung","Inspektion und Wartung","Inspektion und Wartung","Inspektion und Wartung","Inspektion und Wartung","Inspektion und Wartung","Inspektion und Wartung","Inspektion und Wartung","Inspektion und Wartung","Inspektion und Wartung","Inspektion und Wartung","Inspektion und Wartung","Inspektion und Wartung","Inspektion und Wartung","Inspektion und Wartung","Inspektion und Wartung","Inspektion und Wartung","Inspektion und Wartung","Inspektion und Wartung","Inspektion und Wartung","Inspektion und Wartung","Inspektion und Wartung","Inspektion und Wartung","Inspektion und Wartung","Inspektion und Wartung","Inspektion und Wartung","Inspektion und Wartung","Inspektion und Wartung","Inspektion und Wartung","Inspektion und Wartung","Inspektion und Wartung","Inspektion und Wartung","Inspektion und Wartung","Inspektion und Wartung","Inspektion und Wartung","Inspektion und Wartung","Inspektion und Wartung","Inspektion und Wartung","Inspektion und Wartung","Inspektion und Wartung","Inspektion und Wartung","Inspektion und Wartung","Inspektion und Wartung","Inspektion und Wartung","Inspektion und Wartung","Inspektion und Wartung","Inspektion und Wartung","Inspektion und Wartung","Inspektion und Wartung","Inspektion und Wartung","Inspektion und Wartung","Inspektion und Wartung","Inspektion und Wartung","Inspektion und Wartung","Inspektion und Wartung","Inspektion und Wartung","Inspektion und Wartung","Inspektion und Wartung","Inspektion und Wartung","Inspektion und Wartung","Inspektion und Wartung","Inspektion und Wartung","Inspektion und Wartung","Inspektion und Wartung","Inspektion und Wartung","Inspektion und Wartung","Inspektion und Wartung","Inspektion und Wartung","Inspektion und Wartung","Inspektion und Wartung","Inspektion und Wartung","Inspektion und Wartung","Inspektion und Wartung","Inspektion und Wartung","Inspektion und Wartung","Inspektion und Wartung","Inspektion und Wartung","Inspektion und Wartung","Inspektion und Wartung","Inspektion und Wartung","Inspektion und Wartung","Inspektion und Wartung","Inspektion und Wartung","Inspektion und Wartung","Inspektion und Wartung","Inspektion und Wartung","Inspektion und Wartung","Inspektion und Wartung","Inspektion und Wartung","Inspektion und Wartung","Inspektion und Wartung","Inspektion und Wartung","Inspektion und Wartung","Inspektion und Wartung","Inspektion und Wartung","Inspektion und Wartung","Inspektion und Wartung","Inspektion und Wartung","Inspektion und Wartung","Inspektion und Wartung","Inspektion und Wartung","Inspektion und Wartung","Inspektion und Wartung","Inspektion und Wartung","Inspektion und Wartung","Inspektion und Wartung","Inspektion und Wartung","Inspektion und Wartung","Inspektion und Wartung","Inspektion und Wartung","Inspektion und Wartung","Inspektion und Wartung","Inspektion und Wartung","Inspektion und Wartung","Inspektion und Wartung","Inspektion und Wartung","Inspektion und Wartung","Inspektion und Wartung","Inspektion und Wartung","Inspektion und Wartung","Inspektion und Wartung","Inspektion und Wartung","Inspektion und Wartung","Inspektion und Wartung","Inspektion und Wartung","Inspektion und Wartung","Inspektion und Wartung","Inspektion und Wartung","Inspektion und Wartung","Inspektion und Wartung","Inspektion und Wartung","Inspektion und Wartung","Inspektion und Wartung","Inspektion und Wartung","Inspektion und Wartung","Inspektion und Wartung","Inspektion und Wartung","Inspektion und Wartung","Inspektion und Wartung","Inspektion und Wartung","Inspektion und Wartung","Inspektion und Wartung","Inspektion und Wartung","Inspektion und Wartung","Inspektion und Wartung","Inspektion und Wartung","Inspektion und Wartung","Inspektion und Wartung","Inspektion und Wartung","Inspektion und Wartung","Inspektion und Wartung","Inspektion und Wartung","Inspektion und Wartung","Inspektion und Wartung","Inspektion und Wartung","Inspektion und Wartung","Inspektion und Wartung","Inspektion und Wartung","Inspektion und Wartung","Inspektion und Wartung","Inspektion und Wartung","Inspektion und Wartung","Inspektion und Wartung","Inspektion und Wartung","Inspektion und Wartung","Inspektion und Wartung","Inspektion und Wartung","Inspektion und Wartung","Inspektion und Wartung","Inspektion und Wartung","Inspektion und Wartung","Inspektion und Wartung","Inspektion und Wartung",null,"regelmäßige Instandsetzung","regelmäßige Instandsetzung","regelmäßige Instandsetzung","regelmäßige Instandsetzung","regelmäßige Instandsetzung","regelmäßige Instandsetzung","regelmäßige Instandsetzung","regelmäßige Instandsetzung","regelmäßige Instandsetzung","regelmäßige Instandsetzung","regelmäßige Instandsetzung","regelmäßige Instandsetzung","regelmäßige Instandsetzung","regelmäßige Instandsetzung","regelmäßige Instandsetzung","regelmäßige Instandsetzung","regelmäßige Instandsetzung","regelmäßige Instandsetzung","regelmäßige Instandsetzung","regelmäßige Instandsetzung","regelmäßige Instandsetzung","regelmäßige Instandsetzung","regelmäßige Instandsetzung","regelmäßige Instandsetzung","regelmäßige Instandsetzung","regelmäßige Instandsetzung","regelmäßige Instandsetzung","regelmäßige Instandsetzung","regelmäßige Instandsetzung","regelmäßige Instandsetzung","regelmäßige Instandsetzung","regelmäßige Instandsetzung","regelmäßige Instandsetzung","regelmäßige Instandsetzung","regelmäßige Instandsetzung","regelmäßige Instandsetzung","regelmäßige Instandsetzung","regelmäßige Instandsetzung","regelmäßige Instandsetzung","regelmäßige Instandsetzung","regelmäßige Instandsetzung","regelmäßige Instandsetzung","regelmäßige Instandsetzung","regelmäßige Instandsetzung","regelmäßige Instandsetzung","regelmäßige Instandsetzung","regelmäßige Instandsetzung","regelmäßige Instandsetzung","regelmäßige Instandsetzung","regelmäßige Instandsetzung","regelmäßige Instandsetzung","regelmäßige Instandsetzung","regelmäßige Instandsetzung","regelmäßige Instandsetzung","regelmäßige Instandsetzung","regelmäßige Instandsetzung","regelmäßige Instandsetzung","regelmäßige Instandsetzung","regelmäßige Instandsetzung","regelmäßige Instandsetzung","regelmäßige Instandsetzung","regelmäßige Instandsetzung","regelmäßige Instandsetzung","regelmäßige Instandsetzung","regelmäßige Instandsetzung","regelmäßige Instandsetzung","regelmäßige Instandsetzung","regelmäßige Instandsetzung","regelmäßige Instandsetzung","regelmäßige Instandsetzung","regelmäßige Instandsetzung","regelmäßige Instandsetzung","regelmäßige Instandsetzung","regelmäßige Instandsetzung","regelmäßige Instandsetzung","regelmäßige Instandsetzung","regelmäßige Instandsetzung","regelmäßige Instandsetzung","regelmäßige Instandsetzung","regelmäßige Instandsetzung","regelmäßige Instandsetzung","regelmäßige Instandsetzung","regelmäßige Instandsetzung","regelmäßige Instandsetzung","regelmäßige Instandsetzung","regelmäßige Instandsetzung","regelmäßige Instandsetzung","regelmäßige Instandsetzung","regelmäßige Instandsetzung","regelmäßige Instandsetzung","regelmäßige Instandsetzung","regelmäßige Instandsetzung","regelmäßige Instandsetzung","regelmäßige Instandsetzung","regelmäßige Instandsetzung","regelmäßige Instandsetzung","regelmäßige Instandsetzung","regelmäßige Instandsetzung","regelmäßige Instandsetzung","regelmäßige Instandsetzung","regelmäßige Instandsetzung","regelmäßige Instandsetzung","regelmäßige Instandsetzung","regelmäßige Instandsetzung","regelmäßige Instandsetzung","regelmäßige Instandsetzung","regelmäßige Instandsetzung","regelmäßige Instandsetzung","regelmäßige Instandsetzung","regelmäßige Instandsetzung","regelmäßige Instandsetzung","regelmäßige Instandsetzung","regelmäßige Instandsetzung","regelmäßige Instandsetzung","regelmäßige Instandsetzung","regelmäßige Instandsetzung","regelmäßige Instandsetzung","regelmäßige Instandsetzung","regelmäßige Instandsetzung","regelmäßige Instandsetzung","regelmäßige Instandsetzung","regelmäßige Instandsetzung","regelmäßige Instandsetzung","regelmäßige Instandsetzung","regelmäßige Instandsetzung","regelmäßige Instandsetzung","regelmäßige Instandsetzung","regelmäßige Instandsetzung","regelmäßige Instandsetzung","regelmäßige Instandsetzung","regelmäßige Instandsetzung","regelmäßige Instandsetzung","regelmäßige Instandsetzung","regelmäßige Instandsetzung","regelmäßige Instandsetzung","regelmäßige Instandsetzung","regelmäßige Instandsetzung","regelmäßige Instandsetzung","regelmäßige Instandsetzung","regelmäßige Instandsetzung","regelmäßige Instandsetzung","regelmäßige Instandsetzung","regelmäßige Instandsetzung","regelmäßige Instandsetzung","regelmäßige Instandsetzung","regelmäßige Instandsetzung","regelmäßige Instandsetzung","regelmäßige Instandsetzung","regelmäßige Instandsetzung","regelmäßige Instandsetzung","regelmäßige Instandsetzung","regelmäßige Instandsetzung","regelmäßige Instandsetzung","regelmäßige Instandsetzung","regelmäßige Instandsetzung","regelmäßige Instandsetzung","regelmäßige Instandsetzung","regelmäßige Instandsetzung","regelmäßige Instandsetzung","regelmäßige Instandsetzung","regelmäßige Instandsetzung","regelmäßige Instandsetzung","regelmäßige Instandsetzung","regelmäßige Instandsetzung","regelmäßige Instandsetzung","regelmäßige Instandsetzung","regelmäßige Instandsetzung","regelmäßige Instandsetzung","regelmäßige Instandsetzung","regelmäßige Instandsetzung","regelmäßige Instandsetzung","regelmäßige Instandsetzung","regelmäßige Instandsetzung","regelmäßige Instandsetzung","regelmäßige Instandsetzung","regelmäßige Instandsetzung","regelmäßige Instandsetzung","regelmäßige Instandsetzung","regelmäßige Instandsetzung","regelmäßige Instandsetzung","regelmäßige Instandsetzung","regelmäßige Instandsetzung","regelmäßige Instandsetzung","regelmäßige Instandsetzung","regelmäßige Instandsetzung","regelmäßige Instandsetzung","regelmäßige Instandsetzung","regelmäßige Instandsetzung","regelmäßige Instandsetzung","regelmäßige Instandsetzung","regelmäßige Instandsetzung","regelmäßige Instandsetzung","regelmäßige Instandsetzung","regelmäßige Instandsetzung","regelmäßige Instandsetzung","regelmäßige Instandsetzung","regelmäßige Instandsetzung","regelmäßige Instandsetzung","regelmäßige Instandsetzung","regelmäßige Instandsetzung","regelmäßige Instandsetzung","regelmäßige Instandsetzung","regelmäßige Instandsetzung","regelmäßige Instandsetzung","regelmäßige Instandsetzung","regelmäßige Instandsetzung","regelmäßige Instandsetzung","regelmäßige Instandsetzung","regelmäßige Instandsetzung","regelmäßige Instandsetzung","regelmäßige Instandsetzung","regelmäßige Instandsetzung","regelmäßige Instandsetzung","regelmäßige Instandsetzung","regelmäßige Instandsetzung","regelmäßige Instandsetzung","regelmäßige Instandsetzung","regelmäßige Instandsetzung","regelmäßige Instandsetzung","regelmäßige Instandsetzung","regelmäßige Instandsetzung","regelmäßige Instandsetzung","regelmäßige Instandsetzung","regelmäßige Instandsetzung","regelmäßige Instandsetzung","regelmäßige Instandsetzung","regelmäßige Instandsetzung","regelmäßige Instandsetzung","regelmäßige Instandsetzung","regelmäßige Instandsetzung","regelmäßige Instandsetzung","regelmäßige Instandsetzung","regelmäßige Instandsetzung","regelmäßige Instandsetzung","regelmäßige Instandsetzung","regelmäßige Instandsetzung","regelmäßige Instandsetzung","regelmäßige Instandsetzung","regelmäßige Instandsetzung","regelmäßige Instandsetzung","regelmäßige Instandsetzung","regelmäßige Instandsetzung","regelmäßige Instandsetzung"]
[null,null,null,null,"Code DIN 276","Bezeichnung","LCC","Bestand",null,null,"Gesamt\nnetto [€]","Erstherstellung\nnetto [€]",null,null,"netto [€]",null,null,"Gesamt\nnetto [€]","Ersatzhäufigkeit\nim BZR","Kontrolle KG","relevante Nutzungsdauer","Bezeichnung Datensatz","ND\n[a]","Ja/Nein","ND\n[a]","Kontrolle:\nKG Datensatz","Inspektion und Wartung [€]","Instandsetzung [€]","Inspektion, Wartung und Instandsetzung","Bezeichnung Datensatz","Inspektion und Wartung [%]","Instandsetzung [%]","Ja/Nein","Inspektion und Wartung [€]","Instandsetzung [€]","KG 300","KG 400","KG 500","KG 300","KG 400","KG 500","KG 300","KG 400","KG 500","KG 300","KG 400","KG 500","je BGFabc","absolut",null,null,"KG 300 DIN276\n","KG 300 DIN276\nJahr","KG 300 DIN276\nJahr","KG 300 DIN276\nJahr","KG 300 DIN276\nJahr","KG 300 DIN276\nJahr","KG 300 DIN276\nJahr","KG 300 DIN276\nJahr","KG 300 DIN276\nJahr","KG 300 DIN276\nJahr","KG 300 DIN276\nJahr","KG 300 DIN276\nJahr","KG 300 DIN276\nJahr","KG 300 DIN276\nJahr","KG 300 DIN276\nJahr","KG 300 DIN276\nJahr","KG 300 DIN276\nJahr","KG 300 DIN276\nJahr","KG 300 DIN276\nJahr","KG 300 DIN276\nJahr","KG 300 DIN276\nJahr","KG 300 DIN276\nJahr","KG 300 DIN276\nJahr","KG 300 DIN276\nJahr","KG 300 DIN276\nJahr","KG 300 DIN276\nJahr","KG 300 DIN276\nJahr","KG 300 DIN276\nJahr","KG 300 DIN276\nJahr","KG 300 DIN276\nJahr","KG 300 DIN276\nJahr","KG 300 DIN276\nJahr","KG 300 DIN276\nJahr","KG 300 DIN276\nJahr","KG 300 DIN276\nJahr","KG 300 DIN276\nJahr","KG 300 DIN276\nJahr","KG 300 DIN276\nJahr","KG 300 DIN276\nJahr","KG 300 DIN276\nJahr","KG 300 DIN276\nJahr","KG 300 DIN276\nJahr","KG 300 DIN276\nJahr","KG 300 DIN276\nJahr","KG 300 DIN276\nJahr","KG 300 DIN276\nJahr","KG 300 DIN276\nJahr","KG 300 DIN276\nJahr","KG 300 DIN276\nJahr","KG 300 DIN276\nJahr","KG 300 DIN276\nJahr","KG 300 DIN276\nJahr","KG 300 DIN276\nJahr","KG 300 DIN276\nJahr","KG 300 DIN276\nJahr","KG 300 DIN276\nJahr","KG 300 DIN276\nJahr","KG 300 DIN276\nJahr","KG 300 DIN276\nJahr","KG 300 DIN276\nJahr","KG 300 DIN276\nJahr","KG 300 DIN276\nJahr","KG 300 DIN276\nJahr","KG 300 DIN276\nJahr","KG 300 DIN276\nJahr","KG 300 DIN276\nJahr","KG 300 DIN276\nJahr","KG 300 DIN276\nJahr","KG 300 DIN276\nJahr","KG 300 DIN276\nJahr","KG 300 DIN276\nJahr","KG 300 DIN276\nJahr","KG 300 DIN276\nJahr","KG 300 DIN276\nJahr","KG 300 DIN276\nJahr","KG 300 DIN276\nJahr","KG 300 DIN276\nJahr","KG 300 DIN276\nJahr","KG 300 DIN276\nJahr","KG 300 DIN276\nJahr","KG 300 DIN276\nJahr","KG 400 DIN276\n","KG 400 DIN276\n","KG 400 DIN276\n","KG 400 DIN276\n","KG 400 DIN276\n","KG 400 DIN276\n","KG 400 DIN276\n","KG 400 DIN276\n","KG 400 DIN276\n","KG 400 DIN276\n","KG 400 DIN276\n","KG 400 DIN276\n","KG 400 DIN276\n","KG 400 DIN276\n","KG 400 DIN276\n","KG 400 DIN276\n","KG 400 DIN276\n","KG 400 DIN276\n","KG 400 DIN276\n","KG 400 DIN276\n","KG 400 DIN276\n","KG 400 DIN276\n","KG 400 DIN276\n","KG 400 DIN276\n","KG 400 DIN276\n","KG 400 DIN276\n","KG 400 DIN276\n","KG 400 DIN276\n","KG 400 DIN276\n","KG 400 DIN276\n","KG 400 DIN276\n","KG 400 DIN276\n","KG 400 DIN276\n","KG 400 DIN276\n","KG 400 DIN276\n","KG 400 DIN276\n","KG 400 DIN276\n","KG 400 DIN276\n","KG 400 DIN276\n","KG 400 DIN276\n","KG 400 DIN276\n","KG 400 DIN276\n","KG 400 DIN276\n","KG 400 DIN276\n","KG 400 DIN276\n","KG 400 DIN276\n","KG 400 DIN276\n","KG 400 DIN276\n","KG 400 DIN276\n","KG 400 DIN276\n","KG 400 DIN276\n","KG 400 DIN276\n","KG 400 DIN276\n","KG 400 DIN276\n","KG 400 DIN276\n","KG 400 DIN276\n","KG 400 DIN276\n","KG 400 DIN276\n","KG 400 DIN276\n","KG 400 DIN276\n","KG 400 DIN276\n","KG 400 DIN276\n","KG 400 DIN276\n","KG 400 DIN276\n","KG 400 DIN276\n","KG 400 DIN276\n","KG 400 DIN276\n","KG 400 DIN276\n","KG 400 DIN276\n","KG 400 DIN276\n","KG 400 DIN276\n","KG 400 DIN276\n","KG 400 DIN276\n","KG 400 DIN276\n","KG 400 DIN276\n","KG 400 DIN276\n","KG 400 DIN276\n","KG 400 DIN276\n","KG 400 DIN276\n","KG 400 DIN276\n","KG 400 DIN276\n","KG 500 DIN276\n","KG 500 DIN276\n","KG 500 DIN276\n","KG 500 DIN276\n","KG 500 DIN276\n","KG 500 DIN276\n","KG 500 DIN276\n","KG 500 DIN276\n","KG 500 DIN276\n","KG 500 DIN276\n","KG 500 DIN276\n","KG 500 DIN276\n","KG 500 DIN276\n","KG 500 DIN276\n","KG 500 DIN276\n","KG 500 DIN276\n","KG 500 DIN276\n","KG 500 DIN276\n","KG 500 DIN276\n","KG 500 DIN276\n","KG 500 DIN276\n","KG 500 DIN276\n","KG 500 DIN276\n","KG 500 DIN276\n","KG 500 DIN276\n","KG 500 DIN276\n","KG 500 DIN276\n","KG 500 DIN276\n","KG 500 DIN276\n","KG 500 DIN276\n","KG 500 DIN276\n","KG 500 DIN276\n","KG 500 DIN276\n","KG 500 DIN276\n","KG 500 DIN276\n","KG 500 DIN276\n","KG 500 DIN276\n","KG 500 DIN276\n","KG 500 DIN276\n","KG 500 DIN276\n","KG 500 DIN276\n","KG 500 DIN276\n","KG 500 DIN276\n","KG 500 DIN276\n","KG 500 DIN276\n","KG 500 DIN276\n","KG 500 DIN276\n","KG 500 DIN276\n","KG 500 DIN276\n","KG 500 DIN276\n","KG 500 DIN276\n","KG 500 DIN276\n","KG 500 DIN276\n","KG 500 DIN276\n","KG 500 DIN276\n","KG 500 DIN276\n","KG 500 DIN276\n","KG 500 DIN276\n","KG 500 DIN276\n","KG 500 DIN276\n","KG 500 DIN276\n","KG 500 DIN276\n","KG 500 DIN276\n","KG 500 DIN276\n","KG 500 DIN276\n","KG 500 DIN276\n","KG 500 DIN276\n","KG 500 DIN276\n","KG 500 DIN276\n","KG 500 DIN276\n","KG 500 DIN276\n","KG 500 DIN276\n","KG 500 DIN276\n","KG 500 DIN276\n","KG 500 DIN276\n","KG 500 DIN276\n","KG 500 DIN276\n","KG 500 DIN276\n","KG 500 DIN276\n","KG 500 DIN276\n","KG 500 DIN276\n",null,"KG 300 DIN276","KG 300 DIN276","KG 300 DIN276","KG 300 DIN276","KG 300 DIN276","KG 300 DIN276","KG 300 DIN276","KG 300 DIN276","KG 300 DIN276","KG 300 DIN276","KG 300 DIN276","KG 300 DIN276","KG 300 DIN276","KG 300 DIN276","KG 300 DIN276","KG 300 DIN276","KG 300 DIN276","KG 300 DIN276","KG 300 DIN276","KG 300 DIN276","KG 300 DIN276","KG 300 DIN276","KG 300 DIN276","KG 300 DIN276","KG 300 DIN276","KG 300 DIN276","KG 300 DIN276","KG 300 DIN276","KG 300 DIN276","KG 300 DIN276","KG 300 DIN276","KG 300 DIN276","KG 300 DIN276","KG 300 DIN276","KG 300 DIN276","KG 300 DIN276","KG 300 DIN276","KG 300 DIN276","KG 300 DIN276","KG 300 DIN276","KG 300 DIN276","KG 300 DIN276","KG 300 DIN276","KG 300 DIN276","KG 300 DIN276","KG 300 DIN276","KG 300 DIN276","KG 300 DIN276","KG 300 DIN276","KG 300 DIN276","KG 300 DIN276","KG 300 DIN276","KG 300 DIN276","KG 300 DIN276","KG 300 DIN276","KG 300 DIN276","KG 300 DIN276","KG 300 DIN276","KG 300 DIN276","KG 300 DIN276","KG 300 DIN276","KG 300 DIN276","KG 300 DIN276","KG 300 DIN276","KG 300 DIN276","KG 300 DIN276","KG 300 DIN276","KG 300 DIN276","KG 300 DIN276","KG 300 DIN276","KG 300 DIN276","KG 300 DIN276","KG 300 DIN276","KG 300 DIN276","KG 300 DIN276","KG 300 DIN276","KG 300 DIN276","KG 300 DIN276","KG 300 DIN276","KG 300 DIN276","KG 300 DIN276","KG 400 DIN276\n","KG 400 DIN276\n","KG 400 DIN276\n","KG 400 DIN276\n","KG 400 DIN276\n","KG 400 DIN276\n","KG 400 DIN276\n","KG 400 DIN276\n","KG 400 DIN276\n","KG 400 DIN276\n","KG 400 DIN276\n","KG 400 DIN276\n","KG 400 DIN276\n","KG 400 DIN276\n","KG 400 DIN276\n","KG 400 DIN276\n","KG 400 DIN276\n","KG 400 DIN276\n","KG 400 DIN276\n","KG 400 DIN276\n","KG 400 DIN276\n","KG 400 DIN276\n","KG 400 DIN276\n","KG 400 DIN276\n","KG 400 DIN276\n","KG 400 DIN276\n","KG 400 DIN276\n","KG 400 DIN276\n","KG 400 DIN276\n","KG 400 DIN276\n","KG 400 DIN276\n","KG 400 DIN276\n","KG 400 DIN276\n","KG 400 DIN276\n","KG 400 DIN276\n","KG 400 DIN276\n","KG 400 DIN276\n","KG 400 DIN276\n","KG 400 DIN276\n","KG 400 DIN276\n","KG 400 DIN276\n","KG 400 DIN276\n","KG 400 DIN276\n","KG 400 DIN276\n","KG 400 DIN276\n","KG 400 DIN276\n","KG 400 DIN276\n","KG 400 DIN276\n","KG 400 DIN276\n","KG 400 DIN276\n","KG 400 DIN276\n","KG 400 DIN276\n","KG 400 DIN276\n","KG 400 DIN276\n","KG 400 DIN276\n","KG 400 DIN276\n","KG 400 DIN276\n","KG 400 DIN276\n","KG 400 DIN276\n","KG 400 DIN276\n","KG 400 DIN276\n","KG 400 DIN276\n","KG 400 DIN276\n","KG 400 DIN276\n","KG 400 DIN276\n","KG 400 DIN276\n","KG 400 DIN276\n","KG 400 DIN276\n","KG 400 DIN276\n","KG 400 DIN276\n","KG 400 DIN276\n","KG 400 DIN276\n","KG 400 DIN276\n","KG 400 DIN276\n","KG 400 DIN276\n","KG 400 DIN276\n","KG 400 DIN276\n","KG 400 DIN276\n","KG 400 DIN276\n","KG 400 DIN276\n","KG 400 DIN276\n","KG 500 DIN276\n","KG 500 DIN276\n","KG 500 DIN276\n","KG 500 DIN276\n","KG 500 DIN276\n","KG 500 DIN276\n","KG 500 DIN276\n","KG 500 DIN276\n","KG 500 DIN276\n","KG 500 DIN276\n","KG 500 DIN276\n","KG 500 DIN276\n","KG 500 DIN276\n","KG 500 DIN276\n","KG 500 DIN276\n","KG 500 DIN276\n","KG 500 DIN276\n","KG 500 DIN276\n","KG 500 DIN276\n","KG 500 DIN276\n","KG 500 DIN276\n","KG 500 DIN276\n","KG 500 DIN276\n","KG 500 DIN276\n","KG 500 DIN276\n","KG 500 DIN276\n","KG 500 DIN276\n","KG 500 DIN276\n","KG 500 DIN276\n","KG 500 DIN276\n","KG 500 DIN276\n","KG 500 DIN276\n","KG 500 DIN276\n","KG 500 DIN276\n","KG 500 DIN276\n","KG 500 DIN276\n","KG 500 DIN276\n","KG 500 DIN276\n","KG 500 DIN276\n","KG 500 DIN276\n","KG 500 DIN276\n","KG 500 DIN276\n","KG 500 DIN276\n","KG 500 DIN276\n","KG 500 DIN276\n","KG 500 DIN276\n","KG 500 DIN276\n","KG 500 DIN276\n","KG 500 DIN276\n","KG 500 DIN276\n","KG 500 DIN276\n","KG 500 DIN276\n","KG 500 DIN276\n","KG 500 DIN276\n","KG 500 DIN276\n","KG 500 DIN276\n","KG 500 DIN276\n","KG 500 DIN276\n","KG 500 DIN276\n","KG 500 DIN276\n","KG 500 DIN276\n","KG 500 DIN276\n","KG 500 DIN276\n","KG 500 DIN276\n","KG 500 DIN276\n","KG 500 DIN276\n","KG 500 DIN276\n","KG 500 DIN276\n","KG 500 DIN276\n","KG 500 DIN276\n","KG 500 DIN276\n","KG 500 DIN276\n","KG 500 DIN276\n","KG 500 DIN276\n","KG 500 DIN276\n","KG 500 DIN276\n","KG 500 DIN276\n","KG 500 DIN276\n","KG 500 DIN276\n","KG 500 DIN276\n","KG 500 DIN276\n",null,"KG 300 DIN276","KG 300 DIN276","KG 300 DIN276","KG 300 DIN276","KG 300 DIN276","KG 300 DIN276","KG 300 DIN276","KG 300 DIN276","KG 300 DIN276","KG 300 DIN276","KG 300 DIN276","KG 300 DIN276","KG 300 DIN276","KG 300 DIN276","KG 300 DIN276","KG 300 DIN276","KG 300 DIN276","KG 300 DIN276","KG 300 DIN276","KG 300 DIN276","KG 300 DIN276","KG 300 DIN276","KG 300 DIN276","KG 300 DIN276","KG 300 DIN276","KG 300 DIN276","KG 300 DIN276","KG 300 DIN276","KG 300 DIN276","KG 300 DIN276","KG 300 DIN276","KG 300 DIN276","KG 300 DIN276","KG 300 DIN276","KG 300 DIN276","KG 300 DIN276","KG 300 DIN276","KG 300 DIN276","KG 300 DIN276","KG 300 DIN276","KG 300 DIN276","KG 300 DIN276","KG 300 DIN276","KG 300 DIN276","KG 300 DIN276","KG 300 DIN276","KG 300 DIN276","KG 300 DIN276","KG 300 DIN276","KG 300 DIN276","KG 300 DIN276","KG 300 DIN276","KG 300 DIN276","KG 300 DIN276","KG 300 DIN276","KG 300 DIN276","KG 300 DIN276","KG 300 DIN276","KG 300 DIN276","KG 300 DIN276","KG 300 DIN276","KG 300 DIN276","KG 300 DIN276","KG 300 DIN276","KG 300 DIN276","KG 300 DIN276","KG 300 DIN276","KG 300 DIN276","KG 300 DIN276","KG 300 DIN276","KG 300 DIN276","KG 300 DIN276","KG 300 DIN276","KG 300 DIN276","KG 300 DIN276","KG 300 DIN276","KG 300 DIN276","KG 300 DIN276","KG 300 DIN276","KG 300 DIN276","KG 300 DIN276","KG 400 DIN276\n","KG 400 DIN276\n","KG 400 DIN276\n","KG 400 DIN276\n","KG 400 DIN276\n","KG 400 DIN276\n","KG 400 DIN276\n","KG 400 DIN276\n","KG 400 DIN276\n","KG 400 DIN276\n","KG 400 DIN276\n","KG 400 DIN276\n","KG 400 DIN276\n","KG 400 DIN276\n","KG 400 DIN276\n","KG 400 DIN276\n","KG 400 DIN276\n","KG 400 DIN276\n","KG 400 DIN276\n","KG 400 DIN276\n","KG 400 DIN276\n","KG 400 DIN276\n","KG 400 DIN276\n","KG 400 DIN276\n","KG 400 DIN276\n","KG 400 DIN276\n","KG 400 DIN276\n","KG 400 DIN276\n","KG 400 DIN276\n","KG 400 DIN276\n","KG 400 DIN276\n","KG 400 DIN276\n","KG 400 DIN276\n","KG 400 DIN276\n","KG 400 DIN276\n","KG 400 DIN276\n","KG 400 DIN276\n","KG 400 DIN276\n","KG 400 DIN276\n","KG 400 DIN276\n","KG 400 DIN276\n","KG 400 DIN276\n","KG 400 DIN276\n","KG 400 DIN276\n","KG 400 DIN276\n","KG 400 DIN276\n","KG 400 DIN276\n","KG 400 DIN276\n","KG 400 DIN276\n","KG 400 DIN276\n","KG 400 DIN276\n","KG 400 DIN276\n","KG 400 DIN276\n","KG 400 DIN276\n","KG 400 DIN276\n","KG 400 DIN276\n","KG 400 DIN276\n","KG 400 DIN276\n","KG 400 DIN276\n","KG 400 DIN276\n","KG 400 DIN276\n","KG 400 DIN276\n","KG 400 DIN276\n","KG 400 DIN276\n","KG 400 DIN276\n","KG 400 DIN276\n","KG 400 DIN276\n","KG 400 DIN276\n","KG 400 DIN276\n","KG 400 DIN276\n","KG 400 DIN276\n","KG 400 DIN276\n","KG 400 DIN276\n","KG 400 DIN276\n","KG 400 DIN276\n","KG 400 DIN276\n","KG 400 DIN276\n","KG 400 DIN276\n","KG 400 DIN276\n","KG 400 DIN276\n","KG 400 DIN276\n","KG 500 DIN276\n","KG 500 DIN276\n","KG 500 DIN276\n","KG 500 DIN276\n","KG 500 DIN276\n","KG 500 DIN276\n","KG 500 DIN276\n","KG 500 DIN276\n","KG 500 DIN276\n","KG 500 DIN276\n","KG 500 DIN276\n","KG 500 DIN276\n","KG 500 DIN276\n","KG 500 DIN276\n","KG 500 DIN276\n","KG 500 DIN276\n","KG 500 DIN276\n","KG 500 DIN276\n","KG 500 DIN276\n","KG 500 DIN276\n","KG 500 DIN276\n","KG 500 DIN276\n","KG 500 DIN276\n","KG 500 DIN276\n","KG 500 DIN276\n","KG 500 DIN276\n","KG 500 DIN276\n","KG 500 DIN276\n","KG 500 DIN276\n","KG 500 DIN276\n","KG 500 DIN276\n","KG 500 DIN276\n","KG 500 DIN276\n","KG 500 DIN276\n","KG 500 DIN276\n","KG 500 DIN276\n","KG 500 DIN276\n","KG 500 DIN276\n","KG 500 DIN276\n","KG 500 DIN276\n","KG 500 DIN276\n","KG 500 DIN276\n","KG 500 DIN276\n","KG 500 DIN276\n","KG 500 DIN276\n","KG 500 DIN276\n","KG 500 DIN276\n","KG 500 DIN276\n","KG 500 DIN276\n","KG 500 DIN276\n","KG 500 DIN276\n","KG 500 DIN276\n","KG 500 DIN276\n","KG 500 DIN276\n","KG 500 DIN276\n","KG 500 DIN276\n","KG 500 DIN276\n","KG 500 DIN276\n","KG 500 DIN276\n","KG 500 DIN276\n","KG 500 DIN276\n","KG 500 DIN276\n","KG 500 DIN276\n","KG 500 DIN276\n","KG 500 DIN276\n","KG 500 DIN276\n","KG 500 DIN276\n","KG 500 DIN276\n","KG 500 DIN276\n","KG 500 DIN276\n","KG 500 DIN276\n","KG 500 DIN276\n","KG 500 DIN276\n","KG 500 DIN276\n","KG 500 DIN276\n","KG 500 DIN276\n","KG 500 DIN276\n","KG 500 DIN276\n","KG 500 DIN276\n","KG 500 DIN276\n","KG 500 DIN276\n"]
[null,null,null,null,null,null,null,null,null,null,null,null,null,null,null,null,null,null,null,null,"in [a]",null,null,null,null,null,null,null,null,null,null,null,null,null,null,null,null,null,null,null,null,null,null,null,null,null,null,"∑ BZR","∑ BZR",null,null,"∑ BZR",1,2,3,4,5,6,7,8,9,10,11,12,13,14,15,16,17,18,19,20,21,22,23,24,25,26,27,28,29,30,31,32,33,34,35,36,37,38,39,40,41,42,43,44,45,46,47,48,49,50,51,52,53,54,55,56,57,58,59,60,61,62,63,64,65,66,67,68,69,70,71,72,73,74,75,76,77,78,79,80,"∑ BZR",1,2,3,4,5,6,7,8,9,10,11,12,13,14,15,16,17,18,19,20,21,22,23,24,25,26,27,28,29,30,31,32,33,34,35,36,37,38,39,40,41,42,43,44,45,46,47,48,49,50,51,52,53,54,55,56,57,58,59,60,61,62,63,64,65,66,67,68,69,70,71,72,73,74,75,76,77,78,79,80,"∑ BZR",1,2,3,4,5,6,7,8,9,10,11,12,13,14,15,16,17,18,19,20,21,22,23,24,25,26,27,28,29,30,31,32,33,34,35,36,37,38,39,40,41,42,43,44,45,46,47,48,49,50,51,52,53,54,55,56,57,58,59,60,61,62,63,64,65,66,67,68,69,70,71,72,73,74,75,76,77,78,79,80,null,"∑ BZR",1,2,3,4,5,6,7,8,9,10,11,12,13,14,15,16,17,18,19,20,21,22,23,24,25,26,27,28,29,30,31,32,33,34,35,36,37,38,39,40,41,42,43,44,45,46,47,48,49,50,51,52,53,54,55,56,57,58,59,60,61,62,63,64,65,66,67,68,69,70,71,72,73,74,75,76,77,78,79,80,"∑ BZR",1,2,3,4,5,6,7,8,9,10,11,12,13,14,15,16,17,18,19,20,21,22,23,24,25,26,27,28,29,30,31,32,33,34,35,36,37,38,39,40,41,42,43,44,45,46,47,48,49,50,51,52,53,54,55,56,57,58,59,60,61,62,63,64,65,66,67,68,69,70,71,72,73,74,75,76,77,78,79,80,"∑ BZR",1,2,3,4,5,6,7,8,9,10,11,12,13,14,15,16,17,18,19,20,21,22,23,24,25,26,27,28,29,30,31,32,33,34,35,36,37,38,39,40,41,42,43,44,45,46,47,48,49,50,51,52,53,54,55,56,57,58,59,60,61,62,63,64,65,66,67,68,69,70,71,72,73,74,75,76,77,78,79,80,null,"∑ BZR",1,2,3,4,5,6,7,8,9,10,11,12,13,14,15,16,17,18,19,20,21,22,23,24,25,26,27,28,29,30,31,32,33,34,35,36,37,38,39,40,41,42,43,44,45,46,47,48,49,50,51,52,53,54,55,56,57,58,59,60,61,62,63,64,65,66,67,68,69,70,71,72,73,74,75,76,77,78,79,80,"∑ BZR",1,2,3,4,5,6,7,8,9,10,11,12,13,14,15,16,17,18,19,20,21,22,23,24,25,26,27,28,29,30,31,32,33,34,35,36,37,38,39,40,41,42,43,44,45,46,47,48,49,50,51,52,53,54,55,56,57,58,59,60,61,62,63,64,65,66,67,68,69,70,71,72,73,74,75,76,77,78,79,80,"∑ BZR",1,2,3,4,5,6,7,8,9,10,11,12,13,14,15,16,17,18,19,20,21,22,23,24,25,26,27,28,29,30,31,32,33,34,35,36,37,38,39,40,41,42,43,44,45,46,47,48,49,50,51,52,53,54,55,56,57,58,59,60,61,62,63,64,65,66,67,68,69,70,71,72,73,74,75,76,77,78,79,80]
[null,null,null,null,null,null,null,null,null,{"$f":"SUM(J10:J43)","v":10000000},{"$f":"SUM(K10:K43)","v":9821428.5714285728},{"$f":"SUM(L10:L43)","v":9821428.5714285728},null,null,null,{"$f":"SUM(P10:P43)","v":0},{"$f":"SUM(Q10:Q43)","v":0},{"$f":"SUM(R10:R43)","v":0},null,null,null,null,null,null,null,null,null,null,null,null,null,null,null,null,null,{"$f":"SUM(AJ10:AJ43)","v":7032142.8571428573},{"$f":"SUM(AK10:AK43)","v":2789285.7142857136},{"$f":"SUM(AL10:AL43)","v":0},{"$f":"SUMIF($H11:$H42,\"Nein\",AP11:AP42)","v":7032.1428571428578},{"$f":"SUMIF($H11:$H42,\"Nein\",AQ11:AQ42)","v":24473.723214285714},{"$f":"SUMIF($H11:$H42,\"Nein\",AR11:AR42)","v":0},{"$f":"SUM(AP11:AP42)","v":7032.1428571428578},24473.723214285714,0,24612.5,25432.982142857141,0,{"$f":"IF(AND(ISNUMBER(BGFabc),BGFabc>0),AW9/BGFabc,\"\")","v":1058.7960998415504},{"$f":"ERG_BARERSATZ300+ERG_BARERSATZ400+ERG_BARERSATZ500+ERG_BARWART300+ERG_BARWART400+ERG_BARWART500+ERG_BARINST300+ERG_BARINST400+ERG_BARINST500","v":8470368.7987324037},null,null,{"$f":"SUM(AZ10:AZ43)","v":200313.95958101877},0,0,0,0,0,0,0,0,0,0,0,0,0,0,0,0,0,0,0,0,0,0,0,0,0,0,0,0,0,200313.95958101877,0,0,0,0,0,0,0,0,0,0,0,0,0,0,0,0,0,0,0,0,0,0,0,0,0,0,0,0,0,0,0,0,0,{"$f":"SUM(DL10:DL43)","v":0},0,0,0,0,0,0,0,0,0,0,0,0,0,0,0,0,3636515.2609717101,0,0,0,0,0,0,0,0,0,272345.29978020501,0,0,0,0,0,0,0,0,0,286062.66456561338,0,0,0,0,2462031.4336132337,0,0,0,0,300470.93937152816,0,0,0,0,0,0,0,0,0,315604.92364112986,0,0,0,0,0,0,{"$f":"SUM(FX10:FX43)","v":0},0,0,0,0,0,0,0,0,0,0,0,0,0,0,0,0,0,0,0,0,0,0,0,0,0,0,0,0,0,0,0,0,0,0,0,0,0,0,0,0,0,0,0,0,0,0,0,0,0,0,0,0,0,0,0,0,0,0,0,0,0,0,0,{"$f":"SUM(IJ10:IJ43)","v":0},0,0,0,0,0,0,0,0,0,0,0,0,0,0,0,0,0,0,0,0,0,0,0,0,0,0,0,0,0,0,0,0,0,0,0,0,0,0,0,0,0,0,0,0,0,0,0,0,0,0,null,{"$f":"SUM(KJ10:KJ43)","v":399548.41902021552},7066.7839549612954,7101.5956985817957,7136.5789286240706,7171.7344898488209,7207.0632311781264,7242.5660057159512,7278.2436707687384,7314.0970878661228,7350.1271227817206,7386.3346455540459,7422.720530507514,7459.2856562735642,7496.0309058118564,7532.9571664316227,7570.0653298130565,7607.3562920288878,7644.8309535659773,7682.4902193470898,7720.3349987527417,7758.3662056431531,7796.5847583803125,7834.9915798501661,7873.5875974848968,7912.3737432853159,7951.3509538433709,7990.5201703647699,8029.8823386916902,8069.4384093256431,8109.189337450397,8149.1360829550831,8189.2796104573235,8229.6208893265739,8270.1608937074961,8310.9006025434919,8351.8409996003593,8392.9830734900152,8434.3278176944023,8475.8762305894488,8517.6293154692012,8559.5880805700363,8601.7535390950106,8644.1267092383387,8686.7086142099561,8729.5002822602546,8772.5027467048858,8815.7170459497411,8859.1442235159939,8902.7853280653362,8946.6414134252664,8990.7135386145528,9035.002767868813,9079.5101706662008,9124.2368217532257,9169.1838011707332,9214.3521942799453,9259.7430917887141,9305.3575897778228,9351.1967897274699,9397.261798543861,9443.5537285859536,9490.0736976922854,9536.8228292080148,9583.8022520119957,{"$f":"SUM(MV10:MV43)","v":9631.0131005440762},9678.4565148324727,9726.1336405213042,9774.0456288982568,9822.1936369223877,9870.5788272520549,9919.2023682730069,9968.0654341265636,10017.169204738029,10066.514865845113,10116.103609026617,10165.936631731183,10216.015137306218,10266.340335026936,10316.913440125594,10367.735673820795,10418.808263347011,1390534.5236088049,24594.283427163969,24715.437532716503,24837.188456522992,24959.53913857483,25082.49253334614,25206.051609865095,25330.219351785614,25454.998757459442,25580.392840008499,25706.404627397711,25833.037162508041,25960.293503210061,26088.176722437693,26216.689908262524,26345.836163968244,26475.618608125733,26606.040374668231,26737.10461296709,26868.814487907814,27001.173179966485,27134.183885286522,27267.849815755912,27402.174199084755,27537.16027888321,27672.811314739782,27809.13058230008,27946.12137334589,28083.786995874703,28222.130774179495,28361.156048929166,28500.866177249009,28641.264532801968,28782.354505869964,28924.139503435828,29066.622949265569,29209.808283991013,29353.698965192947,29498.298467484547,29643.610282595306,29789.637919455388,29936.38490428029,30083.854780656056,30232.051109624808,30380.977469770758,30530.63745730657,30681.034686160307,{"$f":"SUM(PH10:PH43)","v":30832.172788062569},30984.05541263432,31136.686227474893,31290.068918250628,31444.207188783876,31599.104761142433,31754.765375729341,31911.192791373345,32068.390785419509,32226.363153820603,32385.11371122858,32544.646291086858,32704.964745722751,32866.07294644061,33027.974783615195,33190.67416678572,33354.175024750184,33518.481305660287,33683.596977116751,33849.526026265114,34016.272459892039,34183.840304522055,34352.233606514776,34521.456432162639,34691.512867789061,34862.407019847138,35034.143015018803,35206.725000314465,35380.157143173157,35554.44363156319,35729.588674083207,35905.596500063919,36082.471359670133,36260.217524003507,0,0,0,0,0,0,0,0,0,0,0,0,0,0,0,0,0,0,0,0,0,0,0,0,0,0,0,0,0,0,{"$f":"SUM(RT10:RT43)","v":0},0,0,0,0,0,0,0,0,0,0,0,0,0,0,0,0,0,0,0,0,0,0,0,0,0,0,0,0,0,0,0,0,0,0,0,0,0,0,0,0,0,0,0,0,0,0,0,0,0,0,null,{"$f":"SUM(TT10:TT43)","v":1398419.4665707538},24733.743842364536,24855.58494503628,24978.026250184248,25101.070714470872,25224.721309123444,25348.981020005835,25473.852847690585,25599.339807531433,25725.444929736022,25852.171259439161,25979.521856776297,26107.499796957472,26236.1081703415,26365.350082510675,26495.228654345705,26625.747022101103,26756.908337480927,26888.715767714813,27021.17249563459,27154.28171975103,27288.04665433109,27422.47052947558,27557.556591197132,27693.308101498606,27829.728338451801,27966.820596276695,28104.588185420911,28243.03443263975,28382.162681076392,28521.976290342795,28662.47863660063,28803.67311264301,28945.563127976231,29088.152108902224,29231.443498601257,29375.440757215052,29520.147361930405,29665.566807063078,29811.7026041422,29958.558281995134,30106.137386832546,30254.443482334183,30403.480149734845,30553.250987910898,30703.7596134671,30855.009660824096,31007.004782305979,31159.74864822868,31313.244946988438,31467.497385150938,31622.509687540842,31778.285597331706,31934.828876136286,32092.143304097564,32250.23267997981,32409.100821260501,32568.751564222388,32729.18876404615,32890.416294903516,33052.438050050841,33215.257941923002,33378.879902228051,33543.307882041983,{"$f":"SUM(WF10:WF43)","v":33708.545851904273},33874.597801913653,34041.467741824563,34209.159701143893,34377.677729228351,34547.02589538219,34717.208288955517,34888.229019442981,35060.0922165831,35232.802030457889,35406.362631593154,35580.778211059136,35756.05298057176,35932.191172594277,36109.197040439576,36287.074858372776,36465.828921714528,1445037.1689799004,25558.267769176637,25684.17056606914,25810.693573783767,25937.839847546249,26065.612457632687,26194.014489443693,26323.049043578882,26452.719235911787,26583.028197665055,26713.979075486066,26845.575031522938,26977.8192435009,27110.71490479893,27244.265224527011,27378.473427603501,27513.34275483308,27648.876462984979,27785.077824871598,27921.95012942762,28059.49668178934,28197.720803374516,28336.625831962567,28476.215121775193,28616.49204355734,28757.45998465861,28899.122349115063,29041.48255773139,29184.544048163581,29328.310275001815,29472.784709854055,29617.970841429691,29763.872175623928,29910.492235602382,30057.834561886139,30205.90271243731,30354.700262744878,30504.230805911124,30654.497952738278,30805.505331815799,30957.256589608009,31109.755390542039,31263.005417096432,31417.010369890017,31571.773967771263,31727.299947908064,31883.592065878067,{"$f":"SUM(YR10:YR43)","v":32040.654095759226},32198.489830221108,32357.103080616296,32516.49767707253,32676.6774685852,32837.646323110268,32999.408127657611,33161.966788384998,33325.326230692306,33489.490399316412,33654.463258426345,33820.248791719096,33986.851002515745,34154.273913858196,34322.521568606266,34491.598029535366,34661.507379434559,34832.253721205176,35003.84117795989,35176.273893122256,35349.556030526808,35523.691774519553,35698.685330059059,35874.540922817978,36051.262799285068,36228.855226867752,36407.322493995191,36586.668910221764,36766.898806331235,36948.016534441267,37130.026468108452,37312.933002434125,37496.740554170246,37681.453561826274,0,0,0,0,0,0,0,0,0,0,0,0,0,0,0,0,0,0,0,0,0,0,0,0,0,0,0,0,0,0,{"$f":"SUM(ABD10:ABD43)","v":0},0,0,0,0,0,0,0,0,0,0,0,0,0,0,0,0,0,0,0,0,0,0,0,0,0,0,0,0,0,0,0,0,0,0,0,0,0,0,0,0,0,0,0,0,0,0,0,0,0,0]
[null,null,null,null,0]
[]
[1,null,null,null,{"$f":"IF(ISNUMBER(VLOOKUP(F12,DIN276_Verweis,2,0)),VLOOKUP(F12,DIN276_Verweis,2,0),\"k.A.\")","v":300},"300: Bauwerk - Baukonstruktionen","Ja","Nein",null,{"$f":"O12*M12","v":0},{"$f":"IF(G12=\"Ja\",$J12*PINDbnb,0)","v":0},{"$f":"IF(AND(G12=\"Ja\",H12=\"Nein\"),$J12*PINDbnb,0)","v":0},null,null,null,{"$f":"IF(G12=\"Nein\",$J12,0)","v":0},{"$f":"P12*M12","v":0},{"$f":"IF(G12=\"Nein\",$Q12*PINDbnb,0)","v":0},{"$f":"(BZBNB-MOD(BZBNB-1,U12)-1)/U12","v":49},{"$f":"IF(ISNUMBER(VLOOKUP(V12,ND_Verweis,2,0)),VLOOKUP(V12,ND_Verweis,2,0),\"\")","v":""},{"$f":"IF(AND(IF(X12=\"Nein\",W12,Y12)>0,ISNUMBER(IF(X12=\"Nein\",W12,Y12))),IF(X12=\"Nein\",W12,Y12),1)","v":1},null,{"$f":"IF(ISNUMBER(VLOOKUP(V12,ND_Verweis,5,0)),VLOOKUP(V12,ND_Verweis,5,0),\"\")","v":""},"Nein",null,{"$f":"IF(ISNUMBER(VLOOKUP(AD12,NK_Verweis,4,0)),VLOOKUP(AD12,NK_Verweis,4,0),\"\")","v":300},{"$f":"SUM(AP12:AR12)","v":0},{"$f":"SUM(AS12:AU12)","v":0},{"$f":"SUM(AA12:AB12)","v":0},"300-000: Baukonstruktion ohne Inspektion+Wartung  [IW: 0,001, IN: 0,0035]",{"$f":"IF(ISNUMBER(VLOOKUP(AD12,NK_Verweis,7,0)),VLOOKUP(AD12,NK_Verweis,7,0),0)","v":1E-3},{"$f":"IF(ISNUMBER(VLOOKUP(AD12,NK_Verweis,8,0)),VLOOKUP(AD12,NK_Verweis,8,0),0)","v":3.5000000000000001E-3},"Nein",null,null,{"$f":"IF(AND($E12>=300,$E12<400,$G12=\"Ja\",$H12=\"Nein\"),$K12,0)","v":0},{"$f":"IF(AND($E12>=400,$E12<500,$G12=\"Ja\",$H12=\"Nein\"),$K12,0)","v":0},{"$f":"IF(AND($E12>=500,$E12<600,$G12=\"Ja\",$H12=\"Nein\"),$K12,0)","v":0},{"$f":"IF(AND($E12>=300,$E12<400,$G12=\"Ja\"),$K12,0)","v":0},{"$f":"IF(AND($E12>=400,$E12<500,$G12=\"Ja\"),$K12,0)","v":0},{"$f":"IF(AND($E12>=500,$E12<600,$G12=\"Ja\"),$K12,0)","v":0},{"$f":"IF(AND($E12>=300,$E12<400,$G12=\"Ja\"),IF($AG12=\"Ja\",$AH12,$AM12*$AE12),0)","v":0},{"$f":"IF(AND($E12>=400,$E12<500,$G12=\"Ja\"),IF($AG12=\"Ja\",$AH12,$AN12*$AE12),0)","v":0},{"$f":"IF(AND($E12>=500,$E12<600,$G12=\"Ja\"),IF($AG12=\"Ja\",$AH12,$AO12*$AE12),0)","v":0},{"$f":"IF(AND($E12>=300,$E12<400,$G12=\"Ja\"),IF($AG12=\"Ja\",$AI12,$AM12*$AF12),0)","v":0},{"$f":"IF(AND($E12>=400,$E12<500,$G12=\"Ja\"),IF($AG12=\"Ja\",$AI12,$AN12*$AF12),0)","v":0},{"$f":"IF(AND($E12>=500,$E12<600,$G12=\"Ja\"),IF($AG12=\"Ja\",$AI12,$AO12*$AF12),0)","v":0},{"$f":"IF(AND(ISNUMBER(BGFabc),BGFabc>0),AW12/BGFabc,\"\")","v":0},{"$f":"AZ12+EC12+HF12+KJ12+NM12+QP12+TT12+WW12+ZZ12","v":0},null,null,{"$f":"SUM(OFFSET(BA12,,,,BZBNB-1))","v":0},{"$f":"IF(AND(MOD(BA$8,$U12)=0,BA$8<BZBNB),$AM12*POWER(1+PSBNB,(BA$8))*POWER(1+KALBNB,-(BA$8)),\"\")","v":0},0,0,0,0,0,0,0,0,0,0,0,0,0,0,0,0,0,0,0,0,0,0,0,0,0,0,0,0,0,0,0,{"$f":"IF(AND(MOD(CG$8,$U12)=0,CG$8<BZBNB),$AM12*POWER(1+PSBNB,(CG$8))*POWER(1+KALBNB,-(CG$8)),\"\")","v":0},0,0,0,0,0,0,0,0,0,0,0,0,0,0,0,0,"","","","","","","","","","","","","","","",{"$f":"IF(AND(MOD(DM$8,$U12)=0,DM$8<BZBNB),$AM12*POWER(1+PSBNB,(DM$8))*POWER(1+KALBNB,-(DM$8)),\"\")","v":""},"","","","","","","","","","","","","","","",{"$f":"SUM(OFFSET(ED12,,,,BZBNB-1))","v":0},{"$f":"IF(AND(MOD(ED$8,$U12)=0,ED$8<BZBNB),$AN12*POWER(1+PSBNB,(ED$8))*POWER(1+KALBNB,-(ED$8)),\"\")","v":0},0,0,0,0,0,0,0,0,0,0,0,0,0,0,0,0,0,0,0,0,0,0,0,0,0,0,0,0,0,0,0,{"$f":"IF(AND(MOD(FJ$8,$U12)=0,FJ$8<BZBNB),$AN12*POWER(1+PSBNB,(FJ$8))*POWER(1+KALBNB,-(FJ$8)),\"\")","v":0},0,0,0,0,0,0,0,0,0,0,0,0,0,0,0,0,"","","","","","","","","","","","","","","",{"$f":"IF(AND(MOD(GP$8,$U12)=0,GP$8<BZBNB),$AN12*POWER(1+PSBNB,(GP$8))*POWER(1+KALBNB,-(GP$8)),\"\")","v":""},"","","","","","","","","","","","","","","",{"$f":"SUM(OFFSET(HG12,,,,BZBNB-1))","v":0},{"$f":"IF(AND(MOD(HG$8,$U12)=0,HG$8<BZBNB),$AO12*POWER(1+PSBNB,HG$8)*POWER(1+KALBNB,-HG$8),\"\")","v":0},0,0,0,0,0,0,0,0,0,0,0,0,0,0,0,0,0,0,0,0,0,0,0,0,0,0,0,0,0,0,0,{"$f":"IF(AND(MOD(IM$8,$U12)=0,IM$8<BZBNB),$AO12*POWER(1+PSBNB,IM$8)*POWER(1+KALBNB,-IM$8),\"\")","v":0},0,0,0,0,0,0,0,0,0,0,0,0,0,0,0,0,"","","","","","","","","","","","","","","",{"$f":"IF(AND(MOD(JS$8,$U12)=0,JS$8<BZBNB),$AO12*POWER(1+PSBNB,JS$8)*POWER(1+KALBNB,-JS$8),\"\")","v":""},"","","","","","","","","","","","","","","",null,{"$f":"SUM(OFFSET(KK12,,,,BZBNB))","v":0},{"$f":"IF(AND(ISNUMBER($AP12),$AP12<>0),$AP12*POWER(1+PSBNB,KK$8)*POWER(1+KALBNB,-KK$8),\"\")","v":""},{"$f":"IF(AND(ISNUMBER($AP12),$AP12<>0),$AP12*POWER(1+PSBNB,KL$8)*POWER(1+KALBNB,-KL$8),\"\")","v":""},"","","","","","","","","","","","","","","","","","","","","","","","","","","","","","",{"$f":"IF(AND(ISNUMBER($AP12),$AP12<>0),$AP12*POWER(1+PSBNB,LQ$8)*POWER(1+KALBNB,-LQ$8),\"\")","v":""},"","","","","","","","","","","","","","","","","","","","","","","","","","","","","","","",{"$f":"IF(AND(ISNUMBER($AP12),$AP12<>0),$AP12*POWER(1+PSBNB,MW$8)*POWER(1+KALBNB,-MW$8),\"\")","v":""},"","","","","","","","","","","","","","","",{"$f":"SUM(OFFSET(NN12,,,,BZBNB))","v":0},{"$f":"IF(AND(ISNUMBER($AQ12),$AQ12<>0),$AQ12*POWER(1+PSBNB,NN$8)*POWER(1+KALBNB,-NN$8),\"\")","v":""},"","","","","","","","","","","","","","","","","","","","","","","","","","","","","","","",{"$f":"IF(AND(ISNUMBER($AQ12),$AQ12<>0),$AQ12*POWER(1+PSBNB,OT$8)*POWER(1+KALBNB,-OT$8),\"\")","v":""},"","","","","","","","","","","","","","","","","","","","","","","","","","","","","","","",{"$f":"IF(AND(ISNUMBER($AQ12),$AQ12<>0),$AQ12*POWER(1+PSBNB,PZ$8)*POWER(1+KALBNB,-PZ$8),\"\")","v":""},"","","","","","","","","","","","","","","",{"$f":"SUM(OFFSET(QQ12,,,,BZBNB))","v":0},{"$f":"IF(AND(ISNUMBER($AR12),$AR12<>0),$AR12*POWER(1+PSBNB,QQ$8)*POWER(1+KALBNB,-QQ$8),\"\")","v":""},"","","","","","","","","","","","","","","","","","","","","","","","","","","","","","","",{"$f":"IF(AND(ISNUMBER($AR12),$AR12<>0),$AR12*POWER(1+PSBNB,RW$8)*POWER(1+KALBNB,-RW$8),\"\")","v":""},"","","","","","","","","","","","","","","","","","","","","","","","","","","","","","","",{"$f":"IF(AND(ISNUMBER($AR12),$AR12<>0),$AR12*POWER(1+PSBNB,TC$8)*POWER(1+KALBNB,-TC$8),\"\")","v":""},"","","","","","","","","","","","","","","",null,{"$f":"SUM(OFFSET(TU12,,,,BZBNB))","v":0},{"$f":"IF(AND(ISNUMBER($AS12),$AS12<>0),$AS12*POWER(1+PSBNB,TU$8)*POWER(1+KALBNB,-TU$8),\"\")","v":""},"","","","","","","","","","","","","","","","","","","","","","","","","","","","","","","",{"$f":"IF(AND(ISNUMBER($AS12),$AS12<>0),$AS12*POWER(1+PSBNB,VA$8)*POWER(1+KALBNB,-VA$8),\"\")","v":""},"","","","","","","","","","","","","","","","","","","","","","","","","","","","","","","",{"$f":"IF(AND(ISNUMBER($AS12),$AS12<>0),$AS12*POWER(1+PSBNB,WG$8)*POWER(1+KALBNB,-WG$8),\"\")","v":""},"","","","","","","","","","","","","","","",{"$f":"SUM(OFFSET(WX12,,,,BZBNB))","v":0},{"$f":"IF(AND(ISNUMBER($AT12),$AT12<>0),$AT12*POWER(1+PSBNB,WX$8)*POWER(1+KALBNB,-WX$8),\"\")","v":""},"","","","","","","","","","","","","","","","","","","","","","","","","","","","","","","",{"$f":"IF(AND(ISNUMBER($AT12),$AT12<>0),$AT12*POWER(1+PSBNB,YD$8)*POWER(1+KALBNB,-YD$8),\"\")","v":""},"","","","","","","","","","","","","","","","","","","","","","","","","","","","","","","",{"$f":"IF(AND(ISNUMBER($AT12),$AT12<>0),$AT12*POWER(1+PSBNB,ZJ$8)*POWER(1+KALBNB,-ZJ$8),\"\")","v":""},"","","","","","","","","","","","","","","",{"$f":"SUM(OFFSET(AAA12,,,,BZBNB))","v":0},{"$f":"IF(AND(ISNUMBER($AU12),$AU12<>0),$AU12*POWER(1+PSBNB,AAA$8)*POWER(1+KALBNB,-AAA$8),\"\")","v":""},"","","","","","","","","","","","","","","","","","","","","","","","","","","","","","","",{"$f":"IF(AND(ISNUMBER($AU12),$AU12<>0),$AU12*POWER(1+PSBNB,ABG$8)*POWER(1+KALBNB,-ABG$8),\"\")","v":""},"","","","","","","","","","","","","","","","","","","","","","","","","","","","","","","",{"$f":"IF(AND(ISNUMBER($AU12),$AU12<>0),$AU12*POWER(1+PSBNB,ACM$8)*POWER(1+KALBNB,-ACM$8),\"\")","v":""},"","","","","","","","","","","","","","",""]
[2,null,null,null,310,"310: Baugrube","Ja","Nein",null,87000,85446.428571428565,85446.428571428565,1,"pschl.",87000,0,0,0,0,"",50,null,"","Ja",50,300,85.446428571428569,299.0625,384.50892857142856,"300-000: Baukonstruktion ohne Inspektion+Wartung  [IW: 0,001, IN: 0,0035]",1E-3,3.5000000000000001E-3,"Nein",null,null,85446.428571428565,0,0,85446.428571428565,0,0,85.446428571428569,0,0,299.0625,0,0,2.730852060866173,21846.816486929383,null,null,0,"","","","","","","","","","","","","","","","","","","","","","","","","","","","","","","","","","","","","","","","","","","","","","","","","","","","","","","","","","","","","","","","","","","","","","","","","","","","","","","","",0,{"$f":"IF(AND(MOD(ED$8,$U13)=0,ED$8<BZBNB),$AN13*POWER(1+PSBNB,(ED$8))*POWER(1+KALBNB,-(ED$8)),\"\")","v":""},"","","","","","","","","","","","","","","","","","","","","","","","","","","","","","","",{"$f":"IF(AND(MOD(FJ$8,$U13)=0,FJ$8<BZBNB),$AN13*POWER(1+PSBNB,(FJ$8))*POWER(1+KALBNB,-(FJ$8)),\"\")","v":""},"","","","","","","","","","","","","","","","","","","","","","","","","","","","","","","",{"$f":"IF(AND(MOD(GP$8,$U13)=0,GP$8<BZBNB),$AN13*POWER(1+PSBNB,(GP$8))*POWER(1+KALBNB,-(GP$8)),\"\")","v":""},"","","","","","","","","","","","","","","",0,"","","","","","","","","","","","","","","","","","","","","","","","","","","","","","","","","","","","","","","","","","","","","","","","","","","","","","","","","","","","","","","","","","","","","","","","","","","","","","","","",null,{"$f":"SUM(OFFSET(KK13,,,,BZBNB))","v":4854.8481082065309},85.867346938775526,86.29033879561679,86.715414356186329,87.142583885034554,87.571857697276116,88.003246158839076,88.436759686715121,88.872408749211289,89.310203866202485,89.750155609385757,90.192274602535434,90.636571521759791,91.083057095758605,91.531742106082561,91.982637387393297,92.435753827725307,92.891102368748619,93.348694006033085,93.80853978931404,94.270650822758981,94.73503826523563,95.201713330581626,95.67068728787514,96.141971461707058,96.615577232454385,97.091516036555163,97.569799366784494,98.05043877253226,98.533445860081656,99.018832292889982,99.506609791869721,99.996790135672057,100.48938516097095,100.98440676274916,101.48186689458537,101.98177756894293,102.48415085745991,102.98899889124054,103.49633386114812,104.00616801809961,104.51851367336118,105.03338319884573,105.55078902741148,106.07074365316234,106.59325963174933,107.11834958067425,107.64602617959379,108.17630217062631,108.70919035865899,109.24470361165729,109.78285486097579,110.32365710167032,110.86712339281155,111.41326685780081,111.96210068468649,112.51363812648299,113.06789250149033,113.62487719361592,114.18460565269774,114.74709139482934,115.3123480026856,115.88038912585158,116.45122848115135,117.02487985297971,117.6013570936348,118.18067412365269,118.76284493214362,119.34788357712956,119.93580418588391,120.52662095527255,121.12034815209654,121.71700011343695,122.31659124700069,122.91913603146868,123.52464901684537,124.13314482481019,124.74463814907034,125.35914375571602,125.97667648357668,126.5972512445796,0,"","","","","","","","","","","","","","","","","","","","","","","","","","","","","","","","","","","","","","","","","","","","","","","","","","","","","","","","","","","","","","","","","","","","","","","","","","","","","","","","",0,"","","","","","","","","","","","","","","","","","","","","","","","","","","","","","","","","","","","","","","","","","","","","","","","","","","","","","","","","","","","","","","","","","","","","","","","","","","","","","","","",null,16991.968378722853,300.53571428571433,302.01618578465883,303.50395024665215,304.99904359762098,306.50150194046648,308.01136155593679,309.52865890350296,311.05343062223949,312.58571353170868,314.12554463285016,315.67296110887401,317.22800032615925,318.79069983515512,320.36109737128902,321.93923085587653,323.52513839703857,325.11885829062015,326.72042902111582,328.32988926259912,329.94727787965644,331.57263392832471,333.20599665703571,334.84740550756294,336.49690011597465,338.1545203135903,339.82030612794307,341.49429778374571,343.17653570386295,344.8670605102858,346.56591302511492,348.27313427154405,349.98876547485224,351.71284806339833,353.44542366962202,355.1865341310488,356.93622149130027,358.69452800110969,360.46149611934192,362.23716851401844,364.02158806334864,365.81479785676419,367.61684119596003,369.42776159594018,371.24760278606823,373.07640871112261,374.91422353235981,376.76109162857824,378.61705759719206,380.48216625530648,382.35646264080054,384.23999201341525,386.13279985584609,388.03493187484037,389.94643400230285,391.86735239640274,393.79773344269046,395.73762375521613,397.6870701776557,399.64611978444213,401.61481988190263,403.59321800939966,405.58136194048058,407.57929968402971,409.587079485429,411.60474982772178,413.63235943278448,415.66995726250263,417.71759251995354,419.77531465059366,421.84317334345388,423.92121853233795,426.00950039702934,428.10806936450234,430.21697611014042,432.3362715589588,434.46600688683571,436.60623352174616,438.75700314500614,440.91836769251836,443.09037935602856,0,"","","","","","","","","","","","","","","","","","","","","","","","","","","","","","","","","","","","","","","","","","","","","","","","","","","","","","","","","","","","","","","","","","","","","","","","","","","","","","","","",0,"","","","","","","","","","","","","","","","","","","","","","","","","","","","","","","","","","","","","","","","","","","","","","","","","","","","","","","","","","","","","","","","","","","","","","","","","","","","","","","",""]
[3,null,null,null,320,"320: Gründung","Ja","Nein",null,293000,287767.8571428571,287767.8571428571,1,"pschl.",293000,0,0,0,0,322,50,"322-112: Fundamentplatten  [ND: 50]",50,"Nein",null,300,287.76785714285711,1007.1874999999999,1294.9553571428569,"300-000: Baukonstruktion ohne Inspektion+Wartung  [IW: 0,001, IN: 0,0035]",1E-3,3.5000000000000001E-3,"Nein",null,null,287767.8571428571,0,0,287767.8571428571,0,0,287.76785714285711,0,0,1007.1874999999999,0,0,9.1970075153309008,73576.060122647206,null,null,0,"","","","","","","","","","","","","","","","","","","","","","","","","","","","","","","","","","","","","","","","","","","","","","","","","","","","","","","","","","","","","","","","","","","","","","","","","","","","","","","","",0,"","","","","","","","","","","","","","","","","","","","","","","","","","","","","","","","","","","","","","","","","","","","","","","","","","","","","","","","","","","","","","","","","","","","","","","","","","","","","","","","",0,"","","","","","","","","","","","","","","","","","","","","","","","","","","","","","","","","","","","","","","","","","","","","","","","","","","","","","","","","","","","","","","","","","","","","","","","","","","","","","","","",null,{"$f":"SUM(OFFSET(KK14,,,,BZBNB))","v":16350.235582810492},289.18543279380714,290.60999157604277,292.04156788922518,293.48019630247268,294.92591155519432,296.37874855792933,297.83874239318999,299.30592831630923,300.78034175629108,302.26201831666697,303.7509937763549,305.24730409052427,306.75098539146285,308.26207398945047,309.7806063736349,311.30661921291397,312.84014935682001,314.38123383641022,315.92990986516105,317.48621483986642,319.05018634154067,320.62186213632663,322.20128017640701,323.78847860092139,325.38349573688657,326.98637010012254,328.59714039618223,330.21584552128678,331.84252456326345,333.47721680249151,335.11996171284858,336.77079896266559,338.42976841568372,340.09691013201723,341.77226436912076,343.45587158276174,345.14777242799715,346.84800776015493,348.55661863582066,350.27364631382966,351.99913225626238,353.73311812944593,355.47564580496049,357.22675736065014,358.98649508163845,360.7549014613511,362.53201920253997,364.31789121831611,366.11256063318478,367.9160707840872,369.72846522144721,371.54978771022297,373.38008223096296,375.21939298086937,377.06776437486366,378.92524104666109,380.79186784984665,382.66768985895931,384.55275237057975,386.44710090442521,388.35078120444689,390.26383923993689,392.18632120663608,394.11827352785122,396.0597428555746,398.01077607161199,399.97142028871355,401.94172285171226,403.92173133866646,405.91149356200975,407.91105756970444,409.92047164640258,411.93978431461142,413.9690443358657,416.0083007119045,418.05760268585499,420.11699974342076,422.18654161407801,424.26627827227543,426.35625993864153,0,"","","","","","","","","","","","","","","","","","","","","","","","","","","","","","","","","","","","","","","","","","","","","","","","","","","","","","","","","","","","","","","","","","","","","","","","","","","","","","","","",0,"","","","","","","","","","","","","","","","","","","","","","","","","","","","","","","","","","","","","","","","","","","","","","","","","","","","","","","","","","","","","","","","","","","","","","","","","","","","","","","","",null,57225.824539836722,1012.1490147783252,1017.1349705161496,1022.1454876122882,1027.1806870586543,1032.2406904431798,1037.3256199527525,1042.435598376165,1047.5707491070823,1052.7311961470189,1057.9170641083342,1063.1284782172422,1068.3655643168352,1073.6284488701199,1078.9172589630764,1084.232122307722,1089.5731672451989,1094.9405227488703,1100.3343184274358,1105.7546845280638,1111.2017519395324,1116.6756521953921,1122.1765174771433,1127.7044806174245,1133.2596751032249,1138.8422350791029,1144.4522953504288,1150.0899913866378,1155.7554593245036,1161.4488359714221,1167.1702588087203,1172.91986599497,1178.6977963693296,1184.5041894548933,1190.3391854620602,1196.2029252919226,1202.0955505396662,1208.0172034979901,1213.9680271605421,1219.9481652253721,1225.9577620984039,1231.9969628969184,1238.0659134530608,1244.1647603173617,1250.2936507622753,1256.4527327857347,1262.6421551147291,1268.86206720889,1275.1126192641066,1281.393962216147,1287.7062477443051,1294.0496282750653,1300.4242569857804,1306.8302878083705,1313.2678754330427,1319.7371753120228,1326.2383436633138,1332.7715374744632,1339.3369145063575,1345.9346332970292,1352.5648531654881,1359.2277342155642,1365.9234373397792,1372.6521242232263,1379.4139573474793,1386.2090999945112,1393.037716250642,1399.8999710104974,1406.7960299809929,1413.7260596853328,1420.6902274670342,1427.6887014939655,1434.7216507624091,1441.7892451011398,1448.8916551755301,1456.0290524916657,1463.2016094004925,1470.4094991019726,1477.6528956492732,1484.9319739529642,1492.2469097852454,0,"","","","","","","","","","","","","","","","","","","","","","","","","","","","","","","","","","","","","","","","","","","","","","","","","","","","","","","","","","","","","","","","","","","","","","","","","","","","","","","","",0,"","","","","","","","","","","","","","","","","","","","","","","","","","","","","","","","","","","","","","","","","","","","","","","","","","","","","","","","","","","","","","","","","","","","","","","","","","","","","","","",""]
[4,null,null,null,330,"330: Außenwände","Ja","Nein",null,2175000,2136160.7142857141,2136160.7142857141,1,"pschl.",2175000,0,0,0,0,331,50,"331-211: Betonwand  [ND: 50]",50,"Nein",null,300,2136.1607142857142,7476.5624999999991,9612.7232142857138,"300-000: Baukonstruktion ohne Inspektion+Wartung  [IW: 0,001, IN: 0,0035]",1E-3,3.5000000000000001E-3,"Nein",null,null,2136160.7142857141,0,0,2136160.7142857141,0,0,2136.1607142857142,0,0,7476.5624999999991,0,0,68.271301521654294,546170.41217323439,null,null,0,"","","","","","","","","","","","","","","","","","","","","","","","","","","","","","","","","","","","","","","","","","","","","","","","","","","","","","","","","","","","","","","","","","","","","","","","","","","","","","","","",0,"","","","","","","","","","","","","","","","","","","","","","","","","","","","","","","","","","","","","","","","","","","","","","","","","","","","","","","","","","","","","","","","","","","","","","","","","","","","","","","","",0,"","","","","","","","","","","","","","","","","","","","","","","","","","","","","","","","","","","","","","","","","","","","","","","","","","","","","","","","","","","","","","","","","","","","","","","","","","","","","","","","",null,{"$f":"SUM(OFFSET(KK15,,,,BZBNB))","v":121371.20270516319},2146.6836734693879,2157.2584698904202,2167.8853589046585,2178.5645971258641,2189.296442431903,2200.0811539709771,2210.9189921678781,2221.810218730282,2232.7550966550621,2243.7538902346441,2254.8068650633859,2265.9142880439949,2277.0764273939649,2288.2935526520641,2299.5659346848324,2310.8938456931328,2322.2775592187154,2333.7173501508269,2345.2134947328509,2356.7662705689745,2368.3759566308909,2380.0428332645411,2391.7671821968784,2403.5492865426763,2415.3894308113595,2427.2879009138792,2439.2449841696125,2451.2609693133063,2463.3361465020412,2475.4708073222496,2487.6652447967431,2499.9197533918014,2512.234629024274,2524.6101690687283,2537.0466723646341,2549.5444392235731,2562.1037714364979,2574.7249722810134,2587.4083465287031,2600.1542004524904,2612.9628418340294,2625.8345799711437,2638.7697256852871,2651.7685913290584,2664.8314907937329,2677.958739516856,2691.1506544898443,2704.4075542656574,2717.7297589664745,2731.1175902914324,2744.5713715243951,2758.0914275417576,2771.6780848202884,2785.3316714450202,2799.0525171171621,2812.8409531620746,2826.6973125372579,2840.621929840398,2854.6151413174439,2868.6772848707333,2882.8087000671403,2897.0097281462895,2911.2807120287835,2925.621996324493,2940.0339273408699,2954.5168530913179,2969.0711233035904,2983.6970894282395,2998.3951046470975,3013.1655238818139,3028.0087038024135,3042.9250028359234,3057.9147811750172,3072.978400786717,3088.1162254211345,3103.3286206202547,3118.6159537267586,3133.9785938929003,3149.4169120894171,3164.9312811144896,0,"","","","","","","","","","","","","","","","","","","","","","","","","","","","","","","","","","","","","","","","","","","","","","","","","","","","","","","","","","","","","","","","","","","","","","","","","","","","","","","","",0,"","","","","","","","","","","","","","","","","","","","","","","","","","","","","","","","","","","","","","","","","","","","","","","","","","","","","","","","","","","","","","","","","","","","","","","","","","","","","","","","",null,424799.20946807123,7513.3928571428569,7550.4046446164684,7587.5987561663042,7624.9760899405228,7662.5375485116601,7700.2840388984187,7738.2164725875728,7776.3357655559867,7814.6428382927152,7853.1386158212526,7891.8240277218492,7930.70000815398,7969.7674958788766,8009.027434282224,8048.480771396913,8088.1284599259643,8127.9714572655039,8168.0107255278936,8208.2472315649775,8248.6819469914099,8289.3158482081162,8330.149916425893,8371.1851376890718,8412.422502899366,8453.8630078397564,8495.507653198576,8537.3574445936429,8579.4133925965707,8621.6765127571434,8664.1478256278715,8706.8283567885992,8749.7191368713047,8792.8212015849585,8836.135591740549,8879.6633532762189,8923.4055372825042,8967.3632000277412,9011.5374029835475,9055.9292128504585,9100.5397015837152,9145.3699464191031,9190.4210298990001,9235.6940398985025,9281.1900696517041,9326.9102177780642,9372.8555883089939,9419.0272907144554,9465.4264399298008,9512.0541563826591,9558.9115660200114,9605.9998003353812,9653.3199963961524,9700.8732968710083,9748.6608500575694,9796.6838099100678,9844.943336067261,9893.4405938804011,9942.1767544413924,9991.1529946110531,10040.370497047566,10089.830450234989,10139.534048512012,10189.48249210074,10239.676987135723,10290.118745693044,10340.808985819611,10391.748931562566,10442.939812998837,10494.382866264841,10546.079333586347,10598.030463308447,10650.237509925732,10702.701734112557,10755.424402753508,10808.406788973969,10861.65017217089,10915.155838043653,10968.92507862515,11022.959192312957,11077.259483900712,0,"","","","","","","","","","","","","","","","","","","","","","","","","","","","","","","","","","","","","","","","","","","","","","","","","","","","","","","","","","","","","","","","","","","","","","","","","","","","","","","","",0,"","","","","","","","","","","","","","","","","","","","","","","","","","","","","","","","","","","","","","","","","","","","","","","","","","","","","","","","","","","","","","","","","","","","","","","","","","","","","","","",""]
[5,null,null,null,340,"340: Innenwände","Ja","Nein",null,1954000,1919107.1428571427,1919107.1428571427,1,"pschl.",1954000,0,0,0,0,341,50,"341-211: Betonwand  [ND: 50]",50,"Nein",null,300,1919.1071428571427,6716.875,8635.9821428571431,"300-000: Baukonstruktion ohne Inspektion+Wartung  [IW: 0,001, IN: 0,0035]",1E-3,3.5000000000000001E-3,"Nein",null,null,1919107.1428571427,0,0,1919107.1428571427,0,0,1919.1071428571427,0,0,6716.875,0,0,61.334309504971287,490674.47603977029,null,null,0,"","","","","","","","","","","","","","","","","","","","","","","","","","","","","","","","","","","","","","","","","","","","","","","","","","","","","","","","","","","","","","","","","","","","","","","","","","","","","","","","",0,"","","","","","","","","","","","","","","","","","","","","","","","","","","","","","","","","","","","","","","","","","","","","","","","","","","","","","","","","","","","","","","","","","","","","","","","","","","","","","","","",0,"","","","","","","","","","","","","","","","","","","","","","","","","","","","","","","","","","","","","","","","","","","","","","","","","","","","","","","","","","","","","","","","","","","","","","","","","","","","","","","","",null,109038.77245328229,1928.5608726249122,1938.0611724900598,1947.6082718619318,1957.2024012799716,1966.843792419282,1976.5326780962248,1986.2692922740384,1996.0538700684922,2005.8866477535587,2015.7678627671237,2025.6977537167154,2035.6765603852716,2045.704523736923,2055.78188592282,2065.9088902869712,2076.0857813721295,2086.312804925687,2096.5902079056164,2106.9182384864325,2117.2971460651843,2127.7271812674758,2138.2085959535229,2148.7416432242298,2159.326577427305,2169.9636541634004,2180.6531302922849,2191.3952639390445,2202.1903145003216,2213.0385426505691,2223.9402103483562,2234.8955808426826,2245.9049186793468,2256.9684897073244,2268.0865610851934,2279.2594012875838,2290.4872801116603,2301.7704686836396,2313.1092394653333,2324.5038662607285,2335.9546242226052,2347.4617898591696,2359.0256410407419,2370.64645700646,2382.3245183710251,2394.0601071314732,2405.8535066739937,2417.7050017807614,2429.6148786368249,2441.5834248370074,2453.6109293928544,2465.697682739617,2477.8439767432619,2490.050104707514,2502.3163613809515,2514.6430429641077,2527.030447116641,2539.4788729645065,2551.9886211071894,2564.5599936249587,2577.1932940861666,2589.8888275545705,2602.6469005967124,2615.4678212893068,2628.3518992266936,2641.2994455283033,2654.3107728461769,2667.3861953725132,2680.526028847255,2693.7305905657145,2707.0001993862361,2720.3351757378923,2733.7358416282273,2747.2025206510266,2760.7355379941355,2774.3352204473085,2788.0018964101046,2801.7358958998093,2815.5375505594147,2829.4071936656183,2843.3451601368793,0,"","","","","","","","","","","","","","","","","","","","","","","","","","","","","","","","","","","","","","","","","","","","","","","","","","","","","","","","","","","","","","","","","","","","","","","","","","","","","","","","",0,"","","","","","","","","","","","","","","","","","","","","","","","","","","","","","","","","","","","","","","","","","","","","","","","","","","","","","","","","","","","","","","","","","","","","","","","","","","","","","","","",null,381635.70358648803,6749.9630541871938,6783.2141037152096,6816.6289515167628,6850.2084044799012,6883.9532734674876,6917.8643733367871,6951.9425229591352,6986.1885452397246,7020.6032671374569,7055.1875196849342,7089.9421380085041,7124.867961348451,7159.9658330792308,7195.2366007298697,7230.6811160043999,7266.3002348024529,7302.0948172399058,7338.0657276696584,7374.2138347025148,7410.540011228145,7447.0451344361663,7483.730085837331,7520.5957512848054,7557.6430209955688,7594.8727895719021,7632.2859560229972,7669.8834237866567,7707.6661007511275,7745.6348992769936,7783.7907362192482,7822.1345329493906,7860.6672153777154,7899.3897139756364,7938.3029637981772,7977.4079045065446,8016.7054803908122,8056.1966403927399,8095.8823381286675,8135.763531912552,8175.8411847791176,8216.1162645070945,8256.5897436425967,8297.2625995226117,8338.1358142985882,8379.2103749601574,8420.4872733589782,8461.967506232666,8503.6520752288889,8545.5419869295256,8587.6382528749928,8629.9418895886593,8672.4539186014172,8715.1753664763,8758.1072648333302,8801.2506503743789,8844.6065649082448,8888.176055375774,8931.9601738751644,8975.9599776873547,9020.1765293015833,9064.6108964409996,9109.2641520884936,9154.1373745125748,9199.231647293429,9244.5480593490629,9290.0877049616192,9335.8516838037958,9381.8411009653937,9428.0570669799999,9474.5006978518268,9521.1731150826236,9568.0754456987961,9615.2088222785933,9662.5743829794737,9710.1732715655799,9758.0066374353664,9806.075635649333,9854.3814269579525,9902.9251778296657,9951.7080604790772,0,"","","","","","","","","","","","","","","","","","","","","","","","","","","","","","","","","","","","","","","","","","","","","","","","","","","","","","","","","","","","","","","","","","","","","","","","","","","","","","","","",0,"","","","","","","","","","","","","","","","","","","","","","","","","","","","","","","","","","","","","","","","","","","","","","","","","","","","","","","","","","","","","","","","","","","","","","","","","","","","","","","",""]
[6,null,null,null,350,"350: Decken","Ja","Nein",null,1831000,1798303.5714285714,1798303.5714285714,1,"pschl.",1831000,0,0,0,0,351,50,"351-111: Betondecken: Vollbetondecke, STB-Hohlraumdecke, Porenbetondecke  [ND: 50]",50,"Nein",null,300,1798.3035714285713,6294.0625,8092.3660714285716,"300-000: Baukonstruktion ohne Inspektion+Wartung  [IW: 0,001, IN: 0,0035]",1E-3,3.5000000000000001E-3,"Nein",null,null,1798303.5714285714,0,0,1798303.5714285714,0,0,1798.3035714285713,0,0,6294.0625,0,0,57.473449694781173,459787.59755824937,null,null,0,"","","","","","","","","","","","","","","","","","","","","","","","","","","","","","","","","","","","","","","","","","","","","","","","","","","","","","","","","","","","","","","","","","","","","","","","","","","","","","","","",0,"","","","","","","","","","","","","","","","","","","","","","","","","","","","","","","","","","","","","","","","","","","","","","","","","","","","","","","","","","","","","","","","","","","","","","","","","","","","","","","","",0,"","","","","","","","","","","","","","","","","","","","","","","","","","","","","","","","","","","","","","","","","","","","","","","","","","","","","","","","","","","","","","","","","","","","","","","","","","","","","","","","",null,102175.02167961099,1807.162209711471,1816.0644866066016,1825.0106170824961,1834.000817166647,1843.0353039507193,1852.1142955957973,1861.2380113376482,1870.4066714920211,1879.6204974599625,1888.8797117331644,1898.1845378993376,1907.5352006476112,1916.9319257739539,1926.3749401866341,1935.8644719116912,1945.4007500984487,1954.9840050250427,1964.6144681039834,1974.2923718877471,1984.017950074387,1993.7914375131775,2003.6130702102869,2013.4830853344754,2023.4017212228232,2033.3692173864824,2043.3858145164654,2053.4517544894529,2063.5672803736388,2073.7326364345918,2083.9480681411674,2094.213822171419,2104.5301464185691,2114.8972899969863,2125.3155032482032,2135.7850377469631,2146.3061463072931,2156.8790829886102,2167.5041031018554,2178.1814632156575,2188.9114211625329,2199.6942360451071,2210.5301682423737,2221.4194794159816,2232.3624325165547,2243.3592917900346,2254.4103227840751,2265.5157923544393,2276.6759686714568,2287.8911212264893,2299.1615208384428,2310.4874396603063,2321.8691511857282,2333.3069302556082,2344.8010530647502,2356.3517971685164,2367.9594414895441,2379.6242663244684,2391.3465533506983,2403.1265856332138,2414.9646476314078,2426.8610252059466,2438.8160056256811,2450.8298775745761,2462.9029311586878,2475.0354579131645,2487.2277508092884,2499.4801042615513,2511.7928141347616,2524.166177751189,2536.6004938977476,2549.0960628332041,2561.6531862954371,2574.272167508715,2586.9533111910246,2599.6969235614238,2612.5033123474423,2625.3727867925031,2638.3056576634031,2651.3022372578034,2664.3628394117841,0,"","","","","","","","","","","","","","","","","","","","","","","","","","","","","","","","","","","","","","","","","","","","","","","","","","","","","","","","","","","","","","","","","","","","","","","","","","","","","","","","",0,"","","","","","","","","","","","","","","","","","","","","","","","","","","","","","","","","","","","","","","","","","","","","","","","","","","","","","","","","","","","","","","","","","","","","","","","","","","","","","","","",null,357612.57587863837,6325.0677339901486,6356.2257031231065,6387.5371597887379,6419.0028600832647,6450.6235638275175,6482.4000345852901,6514.3330396817692,6546.423350222075,6578.6717411098698,6611.0789910660769,6643.6458826476819,6676.3732022666391,6709.261740208839,6742.3122906532208,6775.5256516909194,6808.90262534457,6842.4440175876498,6876.1506383639426,6910.0233016071161,6944.0628252603556,6978.2700312961206,7012.6457457360048,7047.1907986706647,7081.9060242798805,7116.7922608526887,7151.8503508076301,7187.0811407130859,7222.4854813077354,7258.0642275210721,7293.8182384940865,7329.7483775999663,7365.8555124649929,7402.1405149894535,7438.6042613687114,7475.2476321143713,7512.0715120755258,7549.0767904601362,7586.2643608564949,7623.6351212548007,7661.1899740688668,7698.9298261578761,7736.8555888483097,7774.9681779559369,7813.2685138079405,7851.7575212651209,7890.4361297442629,7929.3052732405376,7968.3658903501,8007.6189242927139,8047.0653229345498,8086.706038811074,8126.5420291500486,8166.5742558946295,8206.803685726627,8247.2312900898087,8287.8580452134047,8328.6849321356403,8369.7129367274447,8410.9430497162484,8452.3762667099272,8494.0135882208124,8535.8560196898834,8577.9045715110151,8620.1602590554085,8662.6241026960761,8705.2971278325113,8748.1803649154299,8791.2748494716652,8834.5816221291607,8878.1017286421156,8921.8362199162166,8965.7861520340321,9009.952586280504,9054.336589168588,9098.9392324649834,9143.7615932160479,9188.8047537737621,9234.06980182191,9279.5578304023129,9325.2699379412443,0,"","","","","","","","","","","","","","","","","","","","","","","","","","","","","","","","","","","","","","","","","","","","","","","","","","","","","","","","","","","","","","","","","","","","","","","","","","","","","","","","",0,"","","","","","","","","","","","","","","","","","","","","","","","","","","","","","","","","","","","","","","","","","","","","","","","","","","","","","","","","","","","","","","","","","","","","","","","","","","","","","","",""]
[7,null,null,null,360,"360: Dächer","Ja","Nein",null,305000,299553.57142857142,299553.57142857142,1,"pschl.",305000,0,0,0,0,361,50,"361-211: Tragkonstruktion: Flachdach  [ND: 50]",50,"Nein",null,300,299.55357142857144,1048.4375,1347.9910714285716,"300-000: Baukonstruktion ohne Inspektion+Wartung  [IW: 0,001, IN: 0,0035]",1E-3,3.5000000000000001E-3,"Nein",null,null,299553.57142857142,0,0,299553.57142857142,0,0,299.55357142857144,0,0,1048.4375,0,0,9.5736767651055477,76589.414120844376,null,null,0,"","","","","","","","","","","","","","","","","","","","","","","","","","","","","","","",{"$f":"IF(AND(MOD(CF$8,$U18)=0,CF$8<BZBNB),$AM18*POWER(1+PSBNB,(CF$8))*POWER(1+KALBNB,-(CF$8)),\"\")","v":""},"","","","","","","","","","","","","","","","","","","","","","","","","","","","","","","",{"$f":"IF(AND(MOD(DL$8,$U18)=0,DL$8<BZBNB),$AM18*POWER(1+PSBNB,(DL$8))*POWER(1+KALBNB,-(DL$8)),\"\")","v":""},"","","","","","","","","","","","","","","","",0,"","","","","","","","","","","","","","","","","","","","","","","","","","","","","","","","","","","","","","","","","","","","","","","","","","","","","","","","","","","","","","","","","","","","","","","","","","","","","","","","",0,"","","","","","","","","","","","","","","","","","","","","","","","","","","","","","","",{"$f":"IF(AND(MOD(IL$8,$U18)=0,IL$8<BZBNB),$AO18*POWER(1+PSBNB,IL$8)*POWER(1+KALBNB,-IL$8),\"\")","v":""},"","","","","","","","","","","","","","","","","","","","","","","","","","","","","","","",{"$f":"IF(AND(MOD(JR$8,$U18)=0,JR$8<BZBNB),$AO18*POWER(1+PSBNB,JR$8)*POWER(1+KALBNB,-JR$8),\"\")","v":""},"","","","","","","","","","","","","","","","",null,17019.86980463209,301.02920478536248,302.51210727198998,304.00231469697508,305.49986304523617,307.00478847895658,308.51712733845886,310.03691614308184,311.56419159206257,313.09899056542247,314.64135012485815,316.19130751463575,317.74890016249122,319.31416568053305,320.88714186615158,322.46786670293056,324.05637836156581,325.65271520078539,327.25691576827694,328.86901880161821,330.48906322921255,332.11708817122837,333.75313294054484,335.39723704370016,337.04944018184659,338.70978225170791,340.37830334654399,342.05504375711809,343.74004397267061,345.43334468189545,347.13498677392465,348.84501133931343,350.56345967103425,352.29037326547297,354.02579382343094,355.76976325113264,357.52232366123673,359.28351737385378,361.05338691756742,362.83197503046182,364.61932466115383,366.41547896982951,368.22048132928677,370.03437532598281,371.85720476108634,373.68901365153499,375.52984623109938,377.37974695144953,379.23876048323018,381.1069317171378,382.9843057650055,384.87092796089217,386.76684386217755,388.67209925066118,390.58674013366954,392.51081274516531,394.44436354686565,396.38743922936266,398.3400867132512,400.30235315026226,402.27428592440168,404.25593265309323,406.24734118833032,408.24855961782947,{"$f":"IF(AND(ISNUMBER($AP18),$AP18<>0),$AP18*POWER(1+PSBNB,MV$8)*POWER(1+KALBNB,-MV$8),\"\")","v":410.25963626619324},412.28061969607609,414.31155870935726,416.35250234831966,418.40349989683364,420.46460088154714,422.53585507308196,424.61731248723504,426.70902338618703,428.81103827971504,430.92340792641318,433.04618333491766,435.17941576513925,437.32315672949949,439.47745799417686,441.64237158035507,443.81794976548019,0,"","","","","","","","","","","","","","","","","","","","","","","","","","","","","","","",{"$f":"IF(AND(ISNUMBER($AQ18),$AQ18<>0),$AQ18*POWER(1+PSBNB,OS$8)*POWER(1+KALBNB,-OS$8),\"\")","v":""},"","","","","","","","","","","","","","","","","","","","","","","","","","","","","","","",{"$f":"IF(AND(ISNUMBER($AQ18),$AQ18<>0),$AQ18*POWER(1+PSBNB,PY$8)*POWER(1+KALBNB,-PY$8),\"\")","v":""},"","","","","","","","","","","","","","","","",0,"","","","","","","","","","","","","","","","","","","","","","","","","","","","","","","",{"$f":"IF(AND(ISNUMBER($AR18),$AR18<>0),$AR18*POWER(1+PSBNB,RV$8)*POWER(1+KALBNB,-RV$8),\"\")","v":""},"","","","","","","","","","","","","","","","","","","","","","","","","","","","","","","",{"$f":"IF(AND(ISNUMBER($AR18),$AR18<>0),$AR18*POWER(1+PSBNB,TB$8)*POWER(1+KALBNB,-TB$8),\"\")","v":""},"","","","","","","","","","","","","","","","",null,59569.544316212283,1053.6022167487686,1058.7923754519647,1064.0081014394127,1069.2495206583264,1074.5167596763479,1079.809945684606,1085.1292065007863,1090.4746705722189,1095.8464669789787,1101.2447254370034,1106.6695763012251,1112.1211505687193,1117.5995798818658,1123.1049965315303,1128.6375334602569,1134.1973242654801,1139.784503202749,1145.3992051889693,1151.0415658056638,1156.7117213022439,1162.4098085992994,1168.135965291907,1173.8903296529506,1179.6730406364629,1185.4842378809776,1191.3240617129038,1197.1926531499132,1203.0901539043471,1209.016706386634,1214.9724537087361,1220.9575396875969,{"$f":"IF(AND(ISNUMBER($AS18),$AS18<>0),$AS18*POWER(1+PSBNB,UZ$8)*POWER(1+KALBNB,-UZ$8),\"\")","v":1226.9721088486199},1233.0163064291553,1239.0902783820084,1245.194171378964,1251.3281328143285,1257.4923108084881,1263.686854211486,1269.9119126066164,1276.1676363140384,1282.454176394403,1288.7716846525038,1295.1203136409399,1301.5002166638023,1307.9115477803725,1314.3544618088479,1320.8291143300733,1327.3356616913056,1333.8742610099823,1340.445070177519,1347.0482478631225,1353.6839535176214,1360.3523473773141,1367.0535904678434,1373.7878446080786,1380.5552724140298,1387.3560373027692,1394.1903034963791,1401.0582360259179,1407.9600007354059,1414.8957642858263,1421.865694159156,1428.869958662403,{"$f":"IF(AND(ISNUMBER($AS18),$AS18<>0),$AS18*POWER(1+PSBNB,WF$8)*POWER(1+KALBNB,-WF$8),\"\")","v":1435.9087269316763},1442.9821689362661,1450.0904554827503,1457.2337582191187,1464.4122496389175,1471.6261030854146,1478.8754927557868,1486.1605937053225,1493.4815818516547,1500.8386339790027,1508.231927742446,1515.661641672212,1523.1279551779871,1530.6310485532481,1538.171102979619,1545.7483005312426,1553.3628241791805,0,"","","","","","","","","","","","","","","","","","","","","","","","","","","","","","","",{"$f":"IF(AND(ISNUMBER($AT18),$AT18<>0),$AT18*POWER(1+PSBNB,YC$8)*POWER(1+KALBNB,-YC$8),\"\")","v":""},"","","","","","","","","","","","","","","","","","","","","","","","","","","","","","","",{"$f":"IF(AND(ISNUMBER($AT18),$AT18<>0),$AT18*POWER(1+PSBNB,ZI$8)*POWER(1+KALBNB,-ZI$8),\"\")","v":""},"","","","","","","","","","","","","","","","",0,"","","","","","","","","","","","","","","","","","","","","","","","","","","","","","","",{"$f":"IF(AND(ISNUMBER($AU18),$AU18<>0),$AU18*POWER(1+PSBNB,ABF$8)*POWER(1+KALBNB,-ABF$8),\"\")","v":""},"","","","","","","","","","","","","","","","","","","","","","","","","","","","","","","",{"$f":"IF(AND(ISNUMBER($AU18),$AU18<>0),$AU18*POWER(1+PSBNB,ACL$8)*POWER(1+KALBNB,-ACL$8),\"\")","v":""},"","","","","","","","","","","","","","","",""]
[8,null,null,null,370,"370: Baukonstruktive Einbauten","Ja","Nein",null,176000,172857.14285714284,172857.14285714284,1,"pschl.",176000,0,0,0,1,371,30,"371-111: Möblierungssysteme: Büros, Laboratorien   [ND: 30]",30,"Nein",null,300,172.85714285714283,605,777.85714285714289,"300-000: Baukonstruktion ohne Inspektion+Wartung  [IW: 0,001, IN: 0,0035]",1E-3,3.5000000000000001E-3,"Nein",null,null,172857.14285714284,0,0,172857.14285714284,0,0,172.85714285714283,0,0,605,0,0,30.563727277655467,244509.81822124374,null,null,200313.95958101877,{"$f":"IF(AND(MOD(BA$8,$U19)=0,BA$8<BZBNB),$AM19*POWER(1+PSBNB,(BA$8))*POWER(1+KALBNB,-(BA$8)),\"\")","v":""},"","","","","","","","","","","","","","","","","","","","","","","","","","","","",200313.95958101877,"","","","","","","","","","","","","","","","","","","","","","","","","","","","","","","","","","","","","","","","","","","","","","","","","","",0,"","","","","","","","","","","","","","","","","","","","","","","","","","","","","",0,"",{"$f":"IF(AND(MOD(FI$8,$U19)=0,FI$8<BZBNB),$AN19*POWER(1+PSBNB,(FI$8))*POWER(1+KALBNB,-(FI$8)),\"\")","v":""},"","","","","","","","","","","","","","","","","","","","","","","","","","","","","","","",{"$f":"IF(AND(MOD(GO$8,$U19)=0,GO$8<BZBNB),$AN19*POWER(1+PSBNB,(GO$8))*POWER(1+KALBNB,-(GO$8)),\"\")","v":""},"","","","","","","","","","","","","","","","",0,{"$f":"IF(AND(MOD(HG$8,$U19)=0,HG$8<BZBNB),$AO19*POWER(1+PSBNB,HG$8)*POWER(1+KALBNB,-HG$8),\"\")","v":""},"","","","","","","","","","","","","","","","","","","","","","","","","","","","",0,"","","","","","","","","","","","","","","","","","","","","","","","","","","","","","","","","","","","","","","","","","","","","","","","","","",null,9821.3019200499893,173.70865587614355,174.56436354055808,175.42428651366427,176.28844556052968,177.15686154851261,178.0295554477664,178.90654833174551,179.78786137771476,{"$f":"IF(AND(ISNUMBER($AP19),$AP19<>0),$AP19*POWER(1+PSBNB,KS$8)*POWER(1+KALBNB,-KS$8),\"\")","v":180.67351586726016},181.56353318680334,182.45793482811763,183.35674238884735,184.25997757302886,185.16766219161528,186.0798181630025,186.99646751355925,187.91763237815812,188.8433350007106,189.77359773470425,190.70844304374228,191.64789350208585,192.59197179519958,193.54070072029907,194.49410318690158,195.45220221737895,196.41502094751385,197.38258262705824,198.35491062029513,199.33202840660192,200.31395958101879,201.30072785481687,202.29235705607221,203.28887113024007,204.29029414073386,205.29665026950599,206.30796381763165,207.32425920589591,208.34556097538314,209.37189378806971,210.4032824274199,211.43975179898354,212.48132693099822,213.52803297499332,214.57989520639734,215.63693902514802,216.6991899563065,217.76667365067246,218.83941588540492,219.91744256464344,221.00077972013426,222.08945351185903,223.18349022866636,224.28291628890608,225.38775824106827,226.49804276442322,227.6137966696667,228.73504689956658,229.86182052961377,230.99414476867588,232.13204695965473,233.27555458014555,234.42469524310204,235.57949669750153,236.7399868290164,237.90619366068645,239.07814535359628,240.25587020755489,241.43939666177934,242.62875329558125,243.82396882905707,245.02507212378148,246.23209218350459,247.44505815485192,248.66399932802858,249.88894513752621,251.11992516283439,252.35696912915375,253.60010690811512,254.84936851849992,256.10478412696557,0,{"$f":"IF(AND(ISNUMBER($AQ19),$AQ19<>0),$AQ19*POWER(1+PSBNB,NN$8)*POWER(1+KALBNB,-NN$8),\"\")","v":""},"","","","","","","","","","","","","","","","","","","","","","","","","","","","","","","","","","","","","","","","","","","","","","","","","","","","","","","","","","","","","","","","","","","","","","","","","","","","","","","",0,{"$f":"IF(AND(ISNUMBER($AR19),$AR19<>0),$AR19*POWER(1+PSBNB,QQ$8)*POWER(1+KALBNB,-QQ$8),\"\")","v":""},"","","","","","","","","","","","","","","","","","","","","","","","","","","","","","","","","","","","","","","","","","","","","","","","","","","","","","","","","","","","","","","","","","","","","","","","","","","","","","","",null,34374.556720174958,{"$f":"IF(AND(ISNUMBER($AS19),$AS19<>0),$AS19*POWER(1+PSBNB,TU$8)*POWER(1+KALBNB,-TU$8),\"\")","v":607.9802955665026},610.97527239195347,613.98500279782513,617.009559461854,620.04901541979416,623.10344406718241,626.17291916110946,629.25751482200178,632.35730553541066,635.47236615381189,638.60277189841179,641.74859836096596,644.90992150560112,648.08681767065355,651.27936357050885,654.48763629745736,657.71171332355345,660.9516725024871,664.207592071465,667.47955065309804,670.76762725730055,674.07190128319871,677.39245252104695,680.72936115415564,684.08270776082645,687.45257331629864,690.83903919470401,694.24218717103304,697.66209942310684,701.09885853356582,704.55254749185917,708.02324969625272,711.51104895584047,715.01602949256858,718.53827594327106,722.07787336171089,725.63490722063568,729.20946341384115,732.80162825824414,736.41148849596971,740.03913129644241,743.6846442584939,747.34811541247666,751.02963322239088,754.72928658801823,758.44716484707283,762.18335777735376,765.93795559891726,769.71104897625207,773.50272902047004,777.3130872915068,781.14221580033234,784.99020701117149,788.85715384373907,792.74314967548139,796.64828834383354,800.57266414848323,804.51637185364837,808.47950669036572,812.4621643587916,816.46444103050965,820.48643335085728,824.52823844125544,828.58995390155746,832.67167781240266,836.77350873758701,840.89554572644215,845.03788831622774,849.20063653453451,853.38389090169983,857.58775243323532,861.81232264226628,866.05770354198182,870.32399764810009,874.61130798134184,878.91973806992053,883.24939195203831,887.60037417840317,891.97278981474983,896.36674444437961,0,{"$f":"IF(AND(ISNUMBER($AT19),$AT19<>0),$AT19*POWER(1+PSBNB,WX$8)*POWER(1+KALBNB,-WX$8),\"\")","v":""},"","","","","","","","","","","","","","","","","","","","","","","","","","","","","","","","","","","","","","","","","","","","","","","","","","","","","","","","","","","","","","","","","","","","","","","","","","","","","","","",0,{"$f":"IF(AND(ISNUMBER($AU19),$AU19<>0),$AU19*POWER(1+PSBNB,AAA$8)*POWER(1+KALBNB,-AAA$8),\"\")","v":""},"","","","","","","","","","","","","","","","","","","","","","","","","","","","","","","","","","","","","","","","","","","","","","","","","","","","","","","","","","","","","","","","","","","","","","","","","","","","","","",""]
[9,null,null,null,390,"390: Sonstige Maßnahmen für Baukonstruktionen","Ja","Nein",null,339000,332946.42857142858,332946.42857142858,1,"pschl.",339000,0,0,0,0,"",50,null,"","Ja",50,300,332.94642857142861,1165.3125,1498.2589285714287,"300-000: Baukonstruktion ohne Inspektion+Wartung  [IW: 0,001, IN: 0,0035]",1E-3,3.5000000000000001E-3,"Nein",null,null,332946.42857142858,0,0,332946.42857142858,0,0,332.94642857142861,0,0,1165.3125,0,0,10.64090630613371,85127.250449069674,null,null,0,"","","","","","","","","","","","","","","","","","","","","","","","","","","","","","","","","","","","","","","","","","","","","","","","","","","","","","","","","","","","","","","","","","","","","","","","","","","","","","","","",0,{"$f":"IF(AND(MOD(ED$8,$U20)=0,ED$8<BZBNB),$AN20*POWER(1+PSBNB,(ED$8))*POWER(1+KALBNB,-(ED$8)),\"\")","v":""},"","","","","","","","","","","","","","","","","","","","","","","","","","","","","","","","","","","","","","","","","","","","","","","","","","","","","","","","","","","","","","","","","","","","","","","","","","","","","","","",0,"","","","","","","","","","","","","","","","","","","","","","","","","","","","","","","","","","","","","","","","","","","","","","","","","","","","","","","","","","","","","","","","","","","","","","","","","","","","","","","","",null,18917.166766459926,334.5865587614357,{"$f":"IF(AND(ISNUMBER($AP20),$AP20<>0),$AP20*POWER(1+PSBNB,KL$8)*POWER(1+KALBNB,-KL$8),\"\")","v":336.23476841050683},337.89109731893302,339.55558548306578,341.22827309628292,342.90920054995922,344.59840843444175,346.2959375400302,348.00182885796147,349.71612358139976,351.4388631064312,353.17008903306407,354.90984316623184,356.6581675168045,358.41510430260155,360.18069594941244,361.95498509202054,363.7380145752324,365.5298274549134,367.33046699902638,369.13997668867677,370.95840021916302,372.78578150103073,374.62216466113443,376.46759404370152,378.32211421140465,380.18576994643621,382.05860625159124,383.94066835135266,385.8320016929851,387.73265194763036,389.64266501141185,391.56208700654201,393.49096428243638,395.42934341683269,397.37727121691563,399.33479472044729,401.30196119690288,403.27881814861166,405.26541331190543,407.26179465826954,409.26801039550242,411.28410896887931,413.31013906232226,415.34614959957497,417.39218974538591,419.44830890669306,421.5145567338198,423.59098312167123,425.67763821094053,427.77457238931953,429.88183629271543,431.99948080647266,434.12755706660323,436.26611646101986,438.41521063077857,440.57489147132441,442.74521113374487,444.92622202602928,447.11797681433501,449.32052842425776,451.53393004211148,453.75823511621041,455.99349735816241,458.23977074416325,460.49710951630203,462.76556818387007,465.0452015246774,467.33606458637536,469.63821268778622,471.95170142023829,474.27658664890953,476.61292451417512,478.96077143296424,481.32018410012171,483.69121948977778,486.07393485672242,488.46838773779012,490.87463595324715,493.2927376081895,0,"","","","","","","","","","","","","","","","","","","","","","","","","","","","","","","","","","","","","","","","","","","","","","","","","","","","","","","","","","","","","","","","","","","","","","","","","","","","","","","","",0,"","","","","","","","","","","","","","","","","","","","","","","","","","","","","","","","","","","","","","","","","","","","","","","","","","","","","","","","","","","","","","","","","","","","","","","","","","","","","","","","",null,66210.083682609751,1171.0529556650249,1176.821689436774,1182.6188406162653,1188.44454919073,1194.29895583699,1200.1822019248571,1206.0944295205461,1212.0357813901055,1218.006401002865,1224.006432534899,1230.0360208725092,1236.0953116157241,1242.1844510818114,1248.3035863088155,1254.4528650591053,1260.6324358229435,1266.8424478220718,1273.0830510133133,1279.3543960921968,1285.6566344965922,1291.9899184103688,1298.3544007670703,1304.7502352536073,1311.1775763139703,1317.6365791529554,1324.1273997399162,1330.6501948125265,1337.2051218805693,1343.7923392297344,1350.4120059254478,1357.0642818167059,1363.7493275399413,1370.4673045228969,1377.2183749885273,1384.0027019589143,1390.8204492592045,1397.6717815215654,1404.5568641891598,1411.4758635201408,1418.4289465916688,1425.4162813039432,1432.4380363842581,1439.4943813910775,1446.5854867181279,1453.7115235985125,1460.8726641088504,1468.0690811734255,1475.3009485683692,1482.5684409258492,1489.8717337382918,1497.2110033626182,1504.5864270245038,1511.9981828226539,1519.446449733111,1526.9314076135693,1534.4532372077249,1542.0121201496352,1549.6082389681067,1557.2417770911022,1564.9129188501724,1572.621849484902,1580.3687551473897,1588.1538229067364,1595.9772407535681,1603.8391976045714,1611.7398833070567,1619.679488643545,1627.6582053363707,1635.6762260523135,1643.7337444072514,1651.830954970834,1659.9680532711832,1668.1452357996127,1676.3627000153745,1684.6206443504257,1692.9192682142218,1701.2587719985281,1709.6393570822652,1718.0612258363649,1726.5245816286629,0,"","","","","","","","","","","","","","","","","","","","","","","","","","","","","","","","","","","","","","","","","","","","","","","","","","","","","","","","","","","","","","","","","","","","","","","","","","","","","","","","",0,"","","","","","","","","","","","","","","","","","","","","","","","","","","","","","","","","","","","","","","","","","","","","","","","","","","","","","","","","","","","","","","","","","","","","","","","","","","","","","","",""]
[10,null,null,null,"k.A.",null,"Ja","Nein",null,0,0,0,null,null,null,0,0,0,49,"",1,null,"","Nein",null,"",0,0,0,null,0,0,"Nein",null,null,0,0,0,0,0,0,0,0,0,0,0,0,0,0,null,null,0,0,0,0,0,0,0,0,0,0,0,0,0,0,0,0,0,0,0,0,0,0,0,0,0,0,0,0,0,0,0,0,0,0,0,0,0,0,0,0,0,0,0,0,0,0,0,0,0,0,"","","","","","","","","","","","","","","","","","","","","","","","","","","","","","","",0,0,0,0,0,0,0,0,0,0,0,0,0,0,0,0,0,0,0,0,0,0,0,0,0,0,0,0,0,0,0,0,0,0,0,0,0,0,0,0,0,0,0,0,0,0,0,0,0,0,"","","","","","","","","","","","","","","","","","","","","","","","","","","","","","","",0,0,0,0,0,0,0,0,0,0,0,0,0,0,0,0,0,0,0,0,0,0,0,0,0,0,0,0,0,0,0,0,0,0,0,0,0,0,0,0,0,0,0,0,0,0,0,0,0,0,"","","","","","","","","","","","","","","","","","","","","","","","","","","","","","","",null,0,"","","","","","","","","","","","","","","","","","","","","","","","","","","","","","","","","","","","","","","","","","","","","","","","","","","","","","","","","","","","","","","","","","","","","","","","","","","","","","","","",0,"","","","","","","","","","","","","","","","","","","","","","","","","","","","","","","","","","","","","","","","","","","","","","","","","","","","","","","","","","","","","","","","","","","","","","","","","","","","","","","","",0,"","","","","","","","","","","","","","","","","","","","","","","","","","","","","","","","","","","","","","","","","","","","","","","","","","","","","","","","","","","","","","","","","","","","","","","","","","","","","","","","",null,0,"","","","","","","","","","","","","","","","","","","","","","","","","","","","","","","","","","","","","","","","","","","","","","","","","","","","","","","","","","","","","","","","","","","","","","","","","","","","","","","","",0,"","","","","","","","","","","","","","","","","","","","","","","","","","","","","","","","","","","","","","","","","","","","","","","","","","","","","","","","","","","","","","","","","","","","","","","","","","","","","","","","",0,"","","","","","","","","","","","","","","","","","","","","","","","","","","","","","","","","","","","","","","","","","","","","","","","","","","","","","","","","","","","","","","","","","","","","","","","","","","","","","","",""]
[11,null,null,null,400,"400: Bauwerk - Technische Anlagen","Ja","Nein",null,0,0,0,null,null,null,0,0,0,49,"",1,null,"","Nein",null,"",0,0,0,null,0,0,"Nein",null,null,0,0,0,0,0,0,0,0,0,0,0,0,0,0,null,null,0,0,0,0,0,0,0,0,0,0,0,0,0,0,0,0,0,0,0,0,0,0,0,0,0,0,0,0,0,0,0,0,0,0,0,0,0,0,0,0,0,0,0,0,0,0,0,0,0,0,"","","","","","","","","","","","","","",{"$f":"IF(AND(MOD(DL$8,$U22)=0,DL$8<BZBNB),$AM22*POWER(1+PSBNB,(DL$8))*POWER(1+KALBNB,-(DL$8)),\"\")","v":""},"","","","","","","","","","","","","","","","",0,0,0,0,0,0,0,0,0,0,0,0,0,0,0,0,0,0,0,0,0,0,0,0,0,0,0,0,0,0,0,0,0,0,0,0,0,0,0,0,0,0,0,0,0,0,0,0,0,0,"","","","","","","","","","","","","","","","","","","","","","","","","","","","","","","",0,0,0,0,0,0,0,0,0,0,0,0,0,0,0,0,0,0,0,0,0,0,0,0,0,0,0,0,0,0,0,0,0,0,0,0,0,0,0,0,0,0,0,0,0,0,0,0,0,0,"","","","","","","","","","","","","","",{"$f":"IF(AND(MOD(JR$8,$U22)=0,JR$8<BZBNB),$AO22*POWER(1+PSBNB,JR$8)*POWER(1+KALBNB,-JR$8),\"\")","v":""},"","","","","","","","","","","","","","","","",null,0,"","","","","","","","","","","","","","","","","","","","","","","","","","","","","","","","","","","","","","","","","","","","","","","","","","","","","","","","","","","","","","","","","","","","","","","","","","","","","","","","",0,"","","","","","","","","","","","","","","","","","","","","","","","","","","","","","","","","","","","","","","","","","","","","","","","","","","","","","","","","","","","","","","",{"$f":"IF(AND(ISNUMBER($AQ22),$AQ22<>0),$AQ22*POWER(1+PSBNB,PY$8)*POWER(1+KALBNB,-PY$8),\"\")","v":""},"","","","","","","","","","","","","","","","",0,"","","","","","","","","","","","","","","","","","","","","","","","","","","","","","","","","","","","","","","","","","","","","","","","","","","","","","","","","","","","","","","",{"$f":"IF(AND(ISNUMBER($AR22),$AR22<>0),$AR22*POWER(1+PSBNB,TB$8)*POWER(1+KALBNB,-TB$8),\"\")","v":""},"","","","","","","","","","","","","","","","",null,0,"","","","","","","","","","","","","","","","","","","","","","","","","","","","","","","","","","","","","","","","","","","","","","","","","","","","","","","","","","","","","","","",{"$f":"IF(AND(ISNUMBER($AS22),$AS22<>0),$AS22*POWER(1+PSBNB,WF$8)*POWER(1+KALBNB,-WF$8),\"\")","v":""},"","","","","","","","","","","","","","","","",0,"","","","","","","","","","","","","","","","","","","","","","","","","","","","","","","","","","","","","","","","","","","","","","","","","","","","","","","","","","","","","","","",{"$f":"IF(AND(ISNUMBER($AT22),$AT22<>0),$AT22*POWER(1+PSBNB,ZI$8)*POWER(1+KALBNB,-ZI$8),\"\")","v":""},"","","","","","","","","","","","","","","","",0,"","","","","","","","","","","","","","","","","","","","","","","","","","","","","","","","","","","","","","","","","","","","","","","","","","","","","","","","","","","","","","","",{"$f":"IF(AND(ISNUMBER($AU22),$AU22<>0),$AU22*POWER(1+PSBNB,ACL$8)*POWER(1+KALBNB,-ACL$8),\"\")","v":""},"","","","","","","","","","","","","","","",""]
[12,null,null,null,410,"410: Abwasser-, Wasser-, Gasanlagen","Ja","Nein",null,359000,352589.28571428568,352589.28571428568,1,"pschl.",359000,0,0,0,0,410,50,"410-001: Gas-, Wasser- und Abwasseranlagen gesamt (AMEV)  [ND: 50]",50,"Nein",null,410,3561.1517857142853,3455.3749999999995,7016.5267857142844,"410-001: Abwasser-, Wasser-, Gasanlagen gesamt (Anlage3/ AMEV)  [IW: 0,0101, IN: 0,0098]",1.01E-2,9.7999999999999997E-3,"Nein",null,null,0,352589.28571428568,0,0,352589.28571428568,0,0,3561.1517857142853,0,0,3455.3749999999995,0,49.832644209537719,398661.15367630176,null,null,0,{"$f":"IF(AND(MOD(BA$8,$U23)=0,BA$8<BZBNB),$AM23*POWER(1+PSBNB,(BA$8))*POWER(1+KALBNB,-(BA$8)),\"\")","v":""},"","","","","","","","","","","","","","","","","","","","","","","","","","","","","","","","","","","","","","","","","","","","","","","","","","","","","","","","","","","","","","","","","","","","","","","","","","","","","","","",0,"","","","","","","","","","","","","","","","","","","","","","","","","","","","","","","","","","","","","","","","","","","","","","","","","","","","","","","","","","","","","","","",{"$f":"IF(AND(MOD(GO$8,$U23)=0,GO$8<BZBNB),$AN23*POWER(1+PSBNB,(GO$8))*POWER(1+KALBNB,-(GO$8)),\"\")","v":""},"","","","","","","","","","","","","","","","",0,{"$f":"IF(AND(MOD(HG$8,$U23)=0,HG$8<BZBNB),$AO23*POWER(1+PSBNB,HG$8)*POWER(1+KALBNB,-HG$8),\"\")","v":""},"","","","","","","","","","","","","","","","","","","","","","","","","","","","","","","","","","","","","","","","","","","","","","","","","","","","","","","","","","","","","","","","","","","","","","","","","","","","","","","",null,0,"","","","","","","","","","","","","","","","","","","","","","","","","","","","","","","","","","","","","","","","","","","","","","","","","","","","","","","","","","","","","","","","","","","","","","","","","","","","","","","","",202335.56040857523,{"$f":"IF(AND(ISNUMBER($AQ23),$AQ23<>0),$AQ23*POWER(1+PSBNB,NN$8)*POWER(1+KALBNB,-NN$8),\"\")","v":3578.6944053483462},3596.3234418278953,3614.039320851678,3631.8424702154803,3649.7333198224537,3667.7123016935011,3685.7798499777055,3703.9364009628184,3722.1823930857877,3740.5182669433539,3758.9444653026803,3777.4614331120547,3796.0696175116218,3814.7694678441921,3833.5614356660844,3852.4459747580368,3871.423541136156,3890.4945930629351,3909.6595910583187,3928.9189979108246,3948.2732786887109,3967.7229007512178,3987.2683337598437,4006.9100496896958,4026.6485228408765,4046.4842298499466,4066.4176497014232,4086.4492637393641,4106.5795556789653,4126.809011618273,4147.1381200498899,4167.5673718727967,4188.0972604041899,4208.7282813914035,4229.4609330238736,4250.2957159451735,4271.233133265102,4292.2736905718284,4313.4178959441024,4334.6662599635329,4356.0192957269001,4377.47751885856,4399.0414475228881,4420.7116024367961,4442.4885068822969,4464.3726867191572,4486.3646703975755,4508.4649889709644,4530.6741761087533,4552.9927681092895,4575.4213039127826,4597.9603251143262,4620.6103759769576,4643.372003444827,4666.2457571563755,4689.2321894576389,4712.3318554155603,4735.5453128314011,4758.8731222542156,4782.3158469943864,4805.874053137215,4829.5483095566124,4853.339187928812,4877.2472627461966,4901.2731113311538,4925.4173138500264,4949.6804533271215,4974.0631156587824,4998.5658896275454,5023.1893669163528,5047.9341421228373,5072.8008127736894,5097.789979339077,5122.9022452471518,5148.1382168986156,5173.4985036813705,5198.9837179852193,5224.5944752166743,5250.3313938137999,5276.1950952611614,0,{"$f":"IF(AND(ISNUMBER($AR23),$AR23<>0),$AR23*POWER(1+PSBNB,QQ$8)*POWER(1+KALBNB,-QQ$8),\"\")","v":""},"","","","","","","","","","","","","","","","","","","","","","","","","","","","","","","","","","","","","","","","","","","","","","","","","","","","","","","","","","","","","","","","","","","","","","","","","","","","","","","",null,0,{"$f":"IF(AND(ISNUMBER($AS23),$AS23<>0),$AS23*POWER(1+PSBNB,TU$8)*POWER(1+KALBNB,-TU$8),\"\")","v":""},"","","","","","","","","","","","","","","","","","","","","","","","","","","","","","","","","","","","","","","","","","","","","","","","","","","","","","","","","","","","","","","","","","","","","","","","","","","","","","","",196325.59326772654,{"$f":"IF(AND(ISNUMBER($AT23),$AT23<>0),$AT23*POWER(1+PSBNB,WX$8)*POWER(1+KALBNB,-WX$8),\"\")","v":3472.3965517241381},3489.50195345677,3506.6916182521236,3523.9659611991788,3541.3253994316879,3558.7703521382482,3576.3012405724267,3593.9184880629323,3611.6225200238337,3629.4137639648379,3647.2926495016104,3665.259608366152,3683.3150744172167,3701.4594836508004,3719.6932742106565,3738.016886398887,3756.4307626865675,3774.9353477244313,3793.5310883536163,3812.2184336164437,3830.9978347672641,3849.8697452833594,3868.834620875888,3887.8929195008932,3907.045101370356,3926.291628963314,3945.6329670370246,3965.0695826381948,3984.6019451142438,4004.2305261246606,4023.9557996523677,4043.7782420151884,4063.6983318773332,4083.7165502609655,4103.8333805578186,4124.0493085408616,4144.3648223760392,4164.7804126340507,4185.296572302198,4205.9137967962988,4226.632583972636,4247.4534341399885,4268.3768500717133,4289.4033370178813,4310.5334027174767,4331.7675574106679,4353.1063138511136,4374.5501873183612,4396.0996956302761,4417.7553591555479,4439.5177008262644,4461.3872461505334,4483.3645232251674,4505.4500627484458,4527.6443980329195,4549.9480650183041,4572.3616022844044,4594.8855510641315,4617.5204552565656,4640.2668614400973,4663.1253188856144,4686.0963795697817,4709.1805981883517,4732.3785321695768,4755.6907416876538,4779.1177896762638,4802.6602418421571,4826.3186666788188,4850.0936354801925,4873.9857223544805,4897.9955042380006,4922.1235609091245,4946.3704750022735,4970.7368320219894,4995.2232203570729,5019.8302312947953,5044.5584590351637,5069.4085007052881,5094.3809563737859,5119.4764290652856,0,{"$f":"IF(AND(ISNUMBER($AU23),$AU23<>0),$AU23*POWER(1+PSBNB,AAA$8)*POWER(1+KALBNB,-AAA$8),\"\")","v":""},"","","","","","","","","","","","","","","","","","","","","","","","","","","","","","","","","","","","","","","","","","","","","","","","","","","","","","","","","","","","","","","","","","","","","","","","","","","","","","",""]
[13,null,null,null,420,"420: Wärmeversorgungsanlagen","Ja","Nein",null,488000,479285.71428571426,479285.71428571426,1,"pschl.",488000,0,0,0,1,420,25,"420-001: Wärmeversorgungsanlagen gesamt (AMEV)  [ND: 25]",25,"Nein",null,420,1965.0714285714287,3163.2857142857142,5128.3571428571431,"420-001: Wärmeversorgungsanlagen gesamt (Anlage 3/ AMEV)  [IW: 0,0041, IN: 0,0066]",4.1000000000000003E-3,6.6E-3,"Nein",null,null,0,479285.71428571426,0,0,479285.71428571426,0,0,1965.0714285714287,0,0,3163.2857142857142,0,104.16447783225422,833315.82265803381,null,null,0,"","","","","","","","","","","","","","","","","","","","","","","","",0,"","","","","","","","","","","","","","","","","","","","","","","","","","","","","","","","","","","","","","","","","","","","","","","","","","","","","","","",541935.6516027326,{"$f":"IF(AND(MOD(ED$8,$U24)=0,ED$8<BZBNB),$AN24*POWER(1+PSBNB,(ED$8))*POWER(1+KALBNB,-(ED$8)),\"\")","v":""},"","","","","","","","","","","","","","","","","","","","","","","",541935.6516027326,"","","","","","","","","","","","","","","","","","","","","","","","","","","","","","","","","","","","","","","","","","","","","","","","","","","","","","","",0,"","","","","","","","","","","","","","","","","","","","","","","","",0,"","","","","","","","","","","","","","","","","","","","","","","","","","","","","","","","","","","","","","","","","","","","","","","","","","","","","","","",null,0,"","","","","","","","","","","","","","","","","","","","","","","","","","","","","","","","","","","","","","","","","","","","","","","","","","","","","","","","","","","","","","","","","","","","","","","","","","","","","","","","",111650.34591838646,1974.7515833919779,1984.4794237042538,1994.2551844121567,2004.0791015767491,2013.9514124219547,2023.8723553402899,2033.8421698986165,2043.8610968439305,2053.9293781091719,2064.0472568190694,2074.2149772960101,2084.4327850659424,2094.7009268642969,2105.0196506419543,2115.3892055712245,2125.8098420518713,2136.2818117171523,2146.8053674398966,2157.3807633386155,2168.0082547836341,2178.6880984032582,2189.4205520899741,2200.2058750066731,2211.0443275929133,2221.9361715712039,2232.8816699533286,2243.8810870466946,2254.9346884607189,2266.0427411132341,2277.2055132369455,2288.4232743858961,2299.6962954419846,2311.0248486215023,2322.4092074817067,2333.8496469274301,2345.3464432177129,2356.8998739724807,2368.5102181792427,2380.1777561998292,2391.9027697771689,2403.6855420420816,2415.5263575201216,2427.4255021384474,2439.3832632327267,2451.3999295540698,2463.4757912760119,2475.6111400015088,2487.8062687699903,2500.0614720644239,2512.3770458184358,2524.7532874234525,2537.1904957358847,2549.6889710843375,2562.2490152768719,2574.8709316082845,2587.555024867439,2600.301601344619,2613.1109688389279,2625.9834366657205,2638.9193156640754,2651.9189182042915,2664.9825581954465,2678.1105510929615,2691.3032139062279,2704.5608652062588,2717.8838251333837,2731.2724154049765,2744.7269593232286,2758.247781782949,2771.8352092794175,2785.4895699162616,2799.2111934133868,2813.000411114931,2826.8575559972705,2840.7829626770599,2854.7769674193132,2868.8399081455163,2882.9721244418006,2897.173957567129,2911.4457504615502,0,"","","","","","","","","","","","","","","","","","","","","","","","","","","","","","","","","","","","","","","","","","","","","","","","","","","","","","","","","","","","","","","","","","","","","","","","","","","","","","","","",null,0,"","","","","","","","","","","","","","","","","","","","","","","","","","","","","","","","","","","","","","","","","","","","","","","","","","","","","","","","","","","","","","","","","","","","","","","","","","","","","","","","",179729.82513691479,3178.8684025334273,3194.5278527922133,3210.264443200057,3226.0785537576935,3241.9705663377808,3257.9408646941251,3273.9898344709436,3290.1178632121805,3306.3253403708613,3322.6126573185015,3338.9802073545534,3355.4283857159071,3371.9575895864286,3388.5682181065599,3405.2606723829467,3422.0353554981339,3438.8926725202937,3455.8330305130039,3472.8568385450881,3489.9645077004839,3507.1564510881717,3524.4330838521537,3541.7948231814735,3559.2420883202994,3576.7753005780351,3594.3948833395043,3612.1012620751667,3629.8948643514013,3647.7761198408157,3665.7454603326441,3683.8033197431491,3701.9501341261216,3720.1863416833935,3738.5123827754305,3756.9286999319602,3775.4357378626596,3794.0339434678954,3812.7237658495119,3831.5056563216763,3850.3800684217845,3869.3474579213994,3888.4082828372684,3907.5630034423784,3926.8120822770716,3946.1559841602093,3965.5951762004092,3985.1301278073065,4004.7613107029106,4024.4891989329749,4044.3142688784574,4064.2369992670215,4084.2578711845945,4104.3773680869817,4124.5959758115505,4144.9141825889456,4165.3324790549013,4185.851358262069,4206.4713156919324,4227.1928492667694,4248.016459361681,4268.9426488166646,4289.9719229487682,4311.1047895642787,4332.3417589710007,4353.6833439905622,4375.130059970812,4396.6824247982549,4418.3409589105622,4440.1061853091369,4461.9786295717449,4483.9588198652018,4506.0472869581354,4528.2445642337907,4550.551187702923,4572.9676960167308,4595.4946304798705,4618.1325350635143,4640.8819564185078,4663.7434438885493,4686.7175495234706,0,"","","","","","","","","","","","","","","","","","","","","","","","","","","","","","","","","","","","","","","","","","","","","","","","","","","","","","","","","","","","","","","","","","","","","","","","","","","","","","","",""]
[14,null,null,null,430,"430: Lufttechnische Anlagen","Ja","Nein",null,285000,279910.71428571426,279910.71428571426,1,"pschl.",285000,0,0,0,1,430,25,"430-001: Lufttechnische Anlagen gesamt (Anlage 3/ AMEV)  [ND: 25]",25,"Nein",null,430,2687.1428571428569,3079.0178571428569,5766.1607142857138,"430-001: Lufttechnische Anlagen gesamt (Anlage 3/ AMEV)  [IW: 0,0096, IN: 0,011]",9.5999999999999992E-3,1.0999999999999999E-2,"Nein",null,null,0,279910.71428571426,0,0,279910.71428571426,0,0,2687.1428571428569,0,0,3079.0178571428569,0,80.514730969152339,644117.84775321872,null,null,0,"","","","","","","","","","","","","","","","","","","","","","","","",0,"","","","","","","","","","","","","","","","","","","","","","","","","","","","","","","","","","","","","","","","","","","","","","","","","","","","","","","",316499.30472700571,"","","","","","","","","","","","","","","","","","","","","","","","",316499.30472700571,"","","","","","","","","","","","","","","","","","","","","","","","","","","","","","","","","","","","","","","","","","","","","","","","","","","","","","","",0,"","","","","","","","","","","","","","","","","","","","","","","","",0,"","","","","","","","","","","","","","","","","","","","","","","","","","","","","","","","","","","","","","","","","","","","","","","","","","","","","","","",null,0,"","","","","","","","","","","","","","","","","","","","","","","","","","","","","","","","","","","","","","","","","","","","","","","","","","","","","","","","","","","","","","","","","","","","","","","","","","","","","","","","",152676.60257532255,2700.3800140745957,2713.6823786759487,2727.0502721669632,2740.4840173500525,2753.9839386177869,2767.5503619607321,2781.1836149753171,2794.8840268717477,2808.6519284819537,2822.4876522675795,2836.3915323280107,2850.3639044084457,2864.4051059079943,2878.515475887838,2892.6953550794028,2906.9450858926029,2921.2650124240945,2935.6554804655921,2950.1168375122206,2964.6494327709029,2979.2536171687893,2993.9297433617398,3008.6781657428319,3023.4992404509253,3038.3933253792543,3053.3607801840794,3068.4019662933606,3083.5172469154968,3098.7069870480846,3113.9715534867469,3129.3113148339712,3144.7266415080312,3160.2179057519138,3175.7854816423178,3191.4297450986846,3207.1510738922739,3222.9498476552913,3238.8264478900469,3254.7812579781748,3270.8146631898908,3286.9270506932894,3303.1188095636999,3319.3903307930782,3335.7420072994496,3352.1742339363918,3368.687407502583,3385.2819267513632,3401.958192400386,3418.7166071412753,3435.5575756493599,3452.4815045934456,3469.4888026456319,3486.5798804911765,3503.7551508384249,3521.0150284287611,3538.3599300466376,3555.790274529626,3573.306482778542,3590.9089777675977,3608.5981845546321,3626.3745302913544,3644.2384442336775,3662.1903577520693,3680.2307043419823,3698.359919634308,3716.5784414059058,3734.8867095901719,3753.285166287661,3771.7742557767629,3790.3544245244325,3809.0261211969673,3827.7897966708442,3846.6459040436071,3865.5948986448079,3884.6372380469993,3903.7733820767894,3923.0037928259358,3942.3289346625174,3961.7492742421355,3981.2652805191924,0,"","","","","","","","","","","","","","","","","","","","","","","","","","","","","","","","","","","","","","","","","","","","","","","","","","","","","","","","","","","","","","","","","","","","","","","","","","","","","","","","",null,0,"","","","","","","","","","","","","","","","","","","","","","","","","","","","","","","","","","","","","","","","","","","","","","","","","","","","","","","","","","","","","","","","","","","","","","","","","","","","","","","","",174941.94045089046,3094.1854327938076,3109.4277255661914,3124.7451035246454,3140.1379365469347,3155.6065963328806,3171.151456413339,3186.772892159217,3202.4712807905444,3218.2470013855718,3234.1004348899351,3250.0319641258457,3266.0419738013438,3282.1308505195771,3298.2989827881474,3314.5467610284827,3330.8745775852744,3347.2828267359419,3363.7719047001569,3380.3422096494196,3396.9941417166592,3413.7281030059048,3430.544497601993,3447.4437315803275,3464.4262130166849,3481.492351997063,3498.6425606275911,3515.8772530444758,3533.1968454240068,3550.6017559925972,3568.0924050368972,3585.6692149139258,3603.3326100612862,3621.0830170074014,3638.9208643818224,3656.8465829255761,3674.8606055015639,3692.963367105021,3711.1553048740125,3729.4368580999922,3747.8084682384169,3766.2705789193947,3784.8236359584066,3803.4680873670686,3822.2043833639532,3841.0329763854497,3859.954321096709,3878.9688744026034,3898.0770954587756,3917.2794456827114,3936.5763887648918,3955.9683906799896,3975.4559196981199,3995.0394463961402,4014.7194436690288,4034.4963867412885,4054.3707531784385,4074.3430228985299,4094.4136781837456,4114.5832036920401,4134.8520864688498,4155.2208159588436,4175.6898840177546,4196.2597849242466,4216.931015391855,4237.7040745809772,4258.5794641109333,4279.5576880720719,4300.6392530379444,4321.824668077541,4343.1144447675797,4364.5090972048574,4386.0091420186754,4407.6150983833004,4429.3274880305089,4451.146835262186,4473.0736669629878,4495.1085126130511,4517.2519043008015,4539.5043767357802,4561.8664672615751,0,"","","","","","","","","","","","","","","","","","","","","","","","","","","","","","","","","","","","","","","","","","","","","","","","","","","","","","","","","","","","","","","","","","","","","","","","","","","","","","","",""]
[15,null,null,null,440,"440: Starkstromanlagen","Ja","Nein",null,766000,752321.42857142852,752321.42857142852,1,"pschl.",766000,0,0,0,1,440,25,"440-001: Starkstromanlagen gesamt (Anlage 3/ AMEV)  [ND: 25]",25,"Nein",null,440,4513.9285714285716,5266.25,9780.1785714285725,"440-001: Starkstromanlagen gesamt (Anlage 3/ AMEV)  [IW: 0,006, IN: 0,007]",6.0000000000000001E-3,7.0000000000000001E-3,"Nein",null,null,0,752321.42857142852,0,0,752321.42857142852,0,0,4513.9285714285716,0,0,5266.25,0,175.79326095054694,1406346.0876043756,null,null,0,"","","","","","","","","","","","","","","","","","","","","","","","",0,"","","","","","","","","","","","","","","","","","","","","","","","","","","","","","","","","","","","","","",{"$f":"IF(AND(MOD(DL$8,$U26)=0,DL$8<BZBNB),$AM26*POWER(1+PSBNB,(DL$8))*POWER(1+KALBNB,-(DL$8)),\"\")","v":""},"","","","","","","","","","","","","","","",{"$f":"IF(AND(MOD(EB$8,$U26)=0,EB$8<BZBNB),$AM26*POWER(1+PSBNB,(EB$8))*POWER(1+KALBNB,-(EB$8)),\"\")","v":""},850661.28919609252,"","","","","","","","","","","","","","","","","","","","","","","","",850661.28919609252,"","","","","","","","","","","","","","","","","","","","","","","","","","","","","","","","","","","","","","","","","","","","","","","","","","","","","","","",0,"","","","","","","","","","","","","","","","","","","","","","","","",0,"","","","","","","","","","","","","","","","","","","","","","","","","","","","","","","","","","","","","","",{"$f":"IF(AND(MOD(JR$8,$U26)=0,JR$8<BZBNB),$AO26*POWER(1+PSBNB,JR$8)*POWER(1+KALBNB,-JR$8),\"\")","v":""},"","","","","","","","","","","","","","","",{"$f":"IF(AND(MOD(KH$8,$U26)=0,KH$8<BZBNB),$AO26*POWER(1+PSBNB,KH$8)*POWER(1+KALBNB,-KH$8),\"\")","v":""},null,0,"","","","","","","","","","","","","","","","","","","","","","","","","","","","","","","","","","","","","","","",{"$f":"IF(AND(ISNUMBER($AP26),$AP26<>0),$AP26*POWER(1+PSBNB,LX$8)*POWER(1+KALBNB,-LX$8),\"\")","v":""},"","","","","","","","","","","","","","","","","","","","","","","","","","","","","","","","","","","","","","","",{"$f":"IF(AND(ISNUMBER($AP26),$AP26<>0),$AP26*POWER(1+PSBNB,NL$8)*POWER(1+KALBNB,-NL$8),\"\")","v":""},256469.90695766904,4536.1646727656589,4558.5103115477559,4580.9660273681884,4603.5323624783778,4626.2098618009322,4648.99907294281,4671.900546208537,4694.9148346135071,4718.0424938973174,4741.2840825372068,4764.6401617615275,4788.1112955633098,4811.6980507138687,4835.4009967764996,4859.2207061202262,4883.1577539336276,4907.2127182387203,4931.3861799049209,4955.6787226630731,4980.0909331195435,5004.6234007703788,5029.2767180155543,5054.0514801732652,5078.9482854943171,5103.9677351765558,5129.1104333793974,5154.3769872384091,5179.76800687998,5205.284105436037,5230.9258990588778,5256.6940069360144,5282.5890513051581,5308.6116574692242,5334.7624538114387,5361.0420718105097,5387.4511460558815,5413.9903142630546,5440.6602172889834,5467.4614991475491,5494.3948070251254,5521.4607912961847,5548.6601055390238,5575.9934065515308,5603.4613543670584,5631.0646122703438,5658.8038468135492,5686.6797278323338,5714.6929284620519,5742.8441251539853,5771.1339976916897,5799.5632292074106,5828.1325061985835,5856.8425185443903,5885.693959522443,5914.6875258255077,5943.8239175783438,5973.1038383545929,6002.5279951937791,6032.0970986183784,6061.811862650984,6091.6730048315294,6121.6812462346425,6151.8373114870292,{"$f":"IF(AND(ISNUMBER($AQ26),$AQ26<>0),$AQ26*POWER(1+PSBNB,PY$8)*POWER(1+KALBNB,-PY$8),\"\")","v":6182.1419287849976},6212.5958299120175,6243.1997502564127,6273.9544288291054,6304.8606082814658,6335.9190349232476,6367.1304587406048,6398.4956334142034,6430.015316337428,6461.6902686346575,6493.5212551796558,6525.5090446140384,6557.6544093658358,6589.9581256681304,6622.4209735778268,6655.0437369944648,{"$f":"IF(AND(ISNUMBER($AQ26),$AQ26<>0),$AQ26*POWER(1+PSBNB,QO$8)*POWER(1+KALBNB,-QO$8),\"\")","v":6687.8272036791705},0,"","","","","","","","","","","","","","","","","","","","","","","","","","","","","","","","","","","","","","","","","","","","","","","","","","","","","","","","","","","","","","","",{"$f":"IF(AND(ISNUMBER($AR26),$AR26<>0),$AR26*POWER(1+PSBNB,TB$8)*POWER(1+KALBNB,-TB$8),\"\")","v":""},"","","","","","","","","","","","","","","",{"$f":"IF(AND(ISNUMBER($AR26),$AR26<>0),$AR26*POWER(1+PSBNB,TR$8)*POWER(1+KALBNB,-TR$8),\"\")","v":""},null,0,"","","","","","","","","","","","","","","","","","","","","","","","","","","","","","","","","","","","","","","","","","","","","","","","","","","","","","","","","","","","","","","",{"$f":"IF(AND(ISNUMBER($AS26),$AS26<>0),$AS26*POWER(1+PSBNB,WF$8)*POWER(1+KALBNB,-WF$8),\"\")","v":""},"","","","","","","","","","","","","","","",{"$f":"IF(AND(ISNUMBER($AS26),$AS26<>0),$AS26*POWER(1+PSBNB,WV$8)*POWER(1+KALBNB,-WV$8),\"\")","v":""},299214.89145061391,5292.1921182266015,5318.2620301390489,5344.4603652628866,5370.7877562247741,5397.2448387677532,5423.8322517666111,5450.5506372432937,5477.4006403824242,5504.38290954687,5531.4980962934069,5558.7468553884482,5586.1298448238622,5613.6477258328459,5641.3011629059165,5669.0908238069296,5697.0173795892315,5725.0815046118405,5753.2838765557408,5781.6251764402514,5810.1060886394671,5838.727300898775,5867.4895043514798,5896.3933935354771,5925.4396664100368,5954.629024372648,5983.962172275963,6013.4398184448091,6043.0626746933094,6072.8314563420436,6102.7468822353576,6132.8096747586833,6163.0205598560178,6193.3802670474288,6223.8895294466774,6254.5490837789284,6285.3596703985286,6316.3220333068975,6347.4369201704803,6378.7050823388072,6410.1272748626452,6441.7042565122147,6473.4367897955271,6505.3256409767855,6537.3715800949021,6569.5753809820671,6601.937821282474,6634.4596824710561,6667.141749872394,6699.9848126796487,6732.9896639736371,6766.1571007419798,6799.4879238983476,6832.9829383017877,6866.6429527761829,6900.4687801297587,6934.4612371747344,6968.6211447470241,7002.9493277260754,7037.4466150547742,7072.1138397594814,7106.9518389701179,7141.9614539404165,7177.1435300682015,{"$f":"IF(AND(ISNUMBER($AT26),$AT26<>0),$AT26*POWER(1+PSBNB,ZI$8)*POWER(1+KALBNB,-ZI$8),\"\")","v":7212.4989169158307},7248.0284682306883,7283.7330419658147,7319.613500300622,7355.6707096617101,7391.9055407437882,7428.3188685307059,7464.9115723165714,7501.6845357269995,7538.6386467404327,7575.7747977095987,7613.0938853830448,7650.5968109268078,7688.2844799461509,7726.1578025074632,7764.2176931602089,{"$f":"IF(AND(ISNUMBER($AT26),$AT26<>0),$AT26*POWER(1+PSBNB,ZY$8)*POWER(1+KALBNB,-ZY$8),\"\")","v":7802.4650709590314},0,"","","","","","","","","","","","","","","","","","","","","","","","","","","","","","","","","","","","","","","","","","","","","","","","","","","","","","","","","","","","","","","",{"$f":"IF(AND(ISNUMBER($AU26),$AU26<>0),$AU26*POWER(1+PSBNB,ACL$8)*POWER(1+KALBNB,-ACL$8),\"\")","v":""},"","","","","","","","","","","","","","","",{"$f":"IF(AND(ISNUMBER($AU26),$AU26<>0),$AU26*POWER(1+PSBNB,ADB$8)*POWER(1+KALBNB,-ADB$8),\"\")","v":""}]
[16,null,null,null,450,"450: Fernmelde- und informationstechnische Anlagen","Ja","Nein",null,271000,266160.71428571426,266160.71428571426,1,"pschl.",271000,0,0,0,1,450,25,"450-001: Fernmeldetechnische Anlagen gesamt (Anlage 3/ AMEV)  [ND: 25]",25,"Nein",null,450,2768.071428571428,2768.071428571428,5536.142857142856,"450-001: Fernmeldetechnische Anlagen gesamt (Anlage 3/ AMEV)  [IW: 0,0104, IN: 0,0104]",1.04E-2,1.04E-2,"Nein",null,null,0,266160.71428571426,0,0,266160.71428571426,0,0,2768.071428571428,0,0,2768.071428571428,0,76.937685698755303,615501.48559004243,null,null,0,{"$f":"IF(AND(MOD(BA$8,$U27)=0,BA$8<BZBNB),$AM27*POWER(1+PSBNB,(BA$8))*POWER(1+KALBNB,-(BA$8)),\"\")","v":""},"","","","","","","","","","","","","","","","","","","","","","","",0,"","","","","","","","","","","","","","","","","","","","","","","","","","","","","","","","","","","","","","","",{"$f":"IF(AND(MOD(DM$8,$U27)=0,DM$8<BZBNB),$AM27*POWER(1+PSBNB,(DM$8))*POWER(1+KALBNB,-(DM$8)),\"\")","v":""},"","","","","","","","","","","","","","","",300951.97045971418,"","","","","","","","","","","","","","","","","","","","","","","","",300951.97045971418,"","","","","","","","","","","","","","","","","","","","","","","","","","","","","","","","","","","","","","",{"$f":"IF(AND(MOD(GO$8,$U27)=0,GO$8<BZBNB),$AN27*POWER(1+PSBNB,(GO$8))*POWER(1+KALBNB,-(GO$8)),\"\")","v":""},"","","","","","","","","","","","","","","",{"$f":"IF(AND(MOD(HE$8,$U27)=0,HE$8<BZBNB),$AN27*POWER(1+PSBNB,(HE$8))*POWER(1+KALBNB,-(HE$8)),\"\")","v":""},0,{"$f":"IF(AND(MOD(HG$8,$U27)=0,HG$8<BZBNB),$AO27*POWER(1+PSBNB,HG$8)*POWER(1+KALBNB,-HG$8),\"\")","v":""},"","","","","","","","","","","","","","","","","","","","","","","",0,"","","","","","","","","","","","","","","","","","","","","","","","","","","","","","","","","","","","","","","",{"$f":"IF(AND(MOD(JS$8,$U27)=0,JS$8<BZBNB),$AO27*POWER(1+PSBNB,JS$8)*POWER(1+KALBNB,-JS$8),\"\")","v":""},"","","","","","","","","","","","","","","",null,0,"","","","","","","","","","","","","","","","","","","","","","","","","","","","","","","","",{"$f":"IF(AND(ISNUMBER($AP27),$AP27<>0),$AP27*POWER(1+PSBNB,LQ$8)*POWER(1+KALBNB,-LQ$8),\"\")","v":""},"","","","","","","","","","","","","","","","","","","","","","","","","","","","","","","","","","","","","","","","","","","","","","","",157274.75756516415,{"$f":"IF(AND(ISNUMBER($AQ27),$AQ27<>0),$AQ27*POWER(1+PSBNB,NN$8)*POWER(1+KALBNB,-NN$8),\"\")","v":2781.7072484166079},2795.4102397881188,2809.1807335801782,2823.019062317027,2836.9255601609534,2850.900562920368,2864.9444080579065,2879.0574346985868,2893.2399836379886,2907.4923973504915,2921.815019997538,2936.2081974359512,2950.6722772262756,2965.2076086411844,2979.8145426738993,2994.4934320466778,3009.2446312193224,3024.0684963977424,3038.965385542559,3053.9356583777453,3068.9796763993108,3084.0978028840373,3099.2904028982439,3114.5578433066103,3129.900492781027,3145.3187218095059,3160.8129027051186,3176.3834096149981,3192.0306185293566,3207.7549072905872,3223.5566556023632,3239.4362450388285,3255.3940590537986,3271.4304829900248,3287.545904088498,3303.7407114978009,3320.0152962835054,3336.3700514376128,3352.8053718880433,3369.3216545081827,3385.9192981264496,3402.5987035359399,3419.3602735040977,3436.2044127824447,3453.1315281163475,3470.1420282548529,3487.2363239605411,3504.4148280194613,3521.6779552510852,3539.0261225183317,3556.4597487376336,3573.9792548890523,3591.5850640264366,3609.277601287652,3627.057293904832,3644.9245712147085,3662.8798646689684,3680.9236078446788,3699.0562364547504,3717.2781883584703,3735.5899035720577,3753.9918242793115,3772.4843948422631,3791.0680618119309,{"$f":"IF(AND(ISNUMBER($AQ27),$AQ27<>0),$AQ27*POWER(1+PSBNB,PZ$8)*POWER(1+KALBNB,-PZ$8),\"\")","v":3809.7432739390833},3828.5104821850891,3847.3701397327991,3866.3227019974934,3885.3686266378759,3904.5083735671274,3923.7424049640094,3943.07118528403,3962.4951812706508,3982.0148619665665,4001.6306987250218,4021.3431652212066,4041.1527374636753,4061.0598938058615,4081.0651149576142,4101.1688839968165,0,{"$f":"IF(AND(ISNUMBER($AR27),$AR27<>0),$AR27*POWER(1+PSBNB,QQ$8)*POWER(1+KALBNB,-QQ$8),\"\")","v":""},"","","","","","","","","","","","","","","","","","","","","","","","","","","","","","","","","","","","","","","","","","","","","","","","","","","","","","","","","","","","","","","",{"$f":"IF(AND(ISNUMBER($AR27),$AR27<>0),$AR27*POWER(1+PSBNB,TC$8)*POWER(1+KALBNB,-TC$8),\"\")","v":""},"","","","","","","","","","","","","","","",null,0,{"$f":"IF(AND(ISNUMBER($AS27),$AS27<>0),$AS27*POWER(1+PSBNB,TU$8)*POWER(1+KALBNB,-TU$8),\"\")","v":""},"","","","","","","","","","","","","","","","","","","","","","","","","","","","","","","","","","","","","","","","","","","","","","","","","","","","","","","","","","","","","","","",{"$f":"IF(AND(ISNUMBER($AS27),$AS27<>0),$AS27*POWER(1+PSBNB,WG$8)*POWER(1+KALBNB,-WG$8),\"\")","v":""},"","","","","","","","","","","","","","","",157274.75756516415,{"$f":"IF(AND(ISNUMBER($AT27),$AT27<>0),$AT27*POWER(1+PSBNB,WX$8)*POWER(1+KALBNB,-WX$8),\"\")","v":2781.7072484166079},2795.4102397881188,2809.1807335801782,2823.019062317027,2836.9255601609534,2850.900562920368,2864.9444080579065,2879.0574346985868,2893.2399836379886,2907.4923973504915,2921.815019997538,2936.2081974359512,2950.6722772262756,2965.2076086411844,2979.8145426738993,2994.4934320466778,3009.2446312193224,3024.0684963977424,3038.965385542559,3053.9356583777453,3068.9796763993108,3084.0978028840373,3099.2904028982439,3114.5578433066103,3129.900492781027,3145.3187218095059,3160.8129027051186,3176.3834096149981,3192.0306185293566,3207.7549072905872,3223.5566556023632,3239.4362450388285,3255.3940590537986,3271.4304829900248,3287.545904088498,3303.7407114978009,3320.0152962835054,3336.3700514376128,3352.8053718880433,3369.3216545081827,3385.9192981264496,3402.5987035359399,3419.3602735040977,3436.2044127824447,3453.1315281163475,3470.1420282548529,3487.2363239605411,3504.4148280194613,3521.6779552510852,3539.0261225183317,3556.4597487376336,3573.9792548890523,3591.5850640264366,3609.277601287652,3627.057293904832,3644.9245712147085,3662.8798646689684,3680.9236078446788,3699.0562364547504,3717.2781883584703,3735.5899035720577,3753.9918242793115,3772.4843948422631,3791.0680618119309,{"$f":"IF(AND(ISNUMBER($AT27),$AT27<>0),$AT27*POWER(1+PSBNB,ZJ$8)*POWER(1+KALBNB,-ZJ$8),\"\")","v":3809.7432739390833},3828.5104821850891,3847.3701397327991,3866.3227019974934,3885.3686266378759,3904.5083735671274,3923.7424049640094,3943.07118528403,3962.4951812706508,3982.0148619665665,4001.6306987250218,4021.3431652212066,4041.1527374636753,4061.0598938058615,4081.0651149576142,4101.1688839968165,0,{"$f":"IF(AND(ISNUMBER($AU27),$AU27<>0),$AU27*POWER(1+PSBNB,AAA$8)*POWER(1+KALBNB,-AAA$8),\"\")","v":""},"","","","","","","","","","","","","","","","","","","","","","","","","","","","","","","","","","","","","","","","","","","","","","","","","","","","","","","","","","","","","","","",{"$f":"IF(AND(ISNUMBER($AU27),$AU27<>0),$AU27*POWER(1+PSBNB,ACM$8)*POWER(1+KALBNB,-ACM$8),\"\")","v":""},"","","","","","","","","","","","","","",""]
[17,null,null,null,460,"460: Förderanlagen","Ja","Nein",null,197000,193482.14285714284,193482.14285714284,1,"pschl.",197000,0,0,0,1,460,25,"460-001: Aufzüge gesamt (Anlage 3/ AMEV)  [ND: 25]",25,"Nein",null,460,3405.2857142857142,3443.9821428571427,6849.2678571428569,"460-001: Aufzüge gesamt (Anlage 3/ AMEV)  [IW: 0,0176, IN: 0,0178]",1.7600000000000001E-2,1.78E-2,"Nein",null,null,0,193482.14285714284,0,0,193482.14285714284,0,0,3405.2857142857142,0,0,3443.9821428571427,0,75.99139145374167,607931.13162993337,null,null,0,"","","","","","","","","","","","","","","","","","","","","","","","",0,"","","","","","","","","","","","","","","","","","","","","","","","","","","","","","","","","","","","","","","","","","","","","","","","","","","","","","","",218773.20361831621,{"$f":"IF(AND(MOD(ED$8,$U28)=0,ED$8<BZBNB),$AN28*POWER(1+PSBNB,(ED$8))*POWER(1+KALBNB,-(ED$8)),\"\")","v":""},"","","","","","","","","","","","","","","","","","","","","","","",218773.20361831621,"","","","","","","","","","","","","","","","","","","","","","","","","","","","","","","","","","","","","","","",{"$f":"IF(AND(MOD(GP$8,$U28)=0,GP$8<BZBNB),$AN28*POWER(1+PSBNB,(GP$8))*POWER(1+KALBNB,-(GP$8)),\"\")","v":""},"","","","","","","","","","","","","","","",0,"","","","","","","","","","","","","","","","","","","","","","","","",0,"","","","","","","","","","","","","","","","","","","","","","","","","","","","","","","","","","","","","","","","","","","","","","","","","","","","","","","",null,0,"","","","","","","","",{"$f":"IF(AND(ISNUMBER($AP28),$AP28<>0),$AP28*POWER(1+PSBNB,KS$8)*POWER(1+KALBNB,-KS$8),\"\")","v":""},"","","","","","","","","","","","","","","","","","","","","","","","","","","","","","","","","","","","","","","","","","","","","","","","","","","","","","","","","","","","","","","","","","","","","","","",193479.64782498489,3422.0605207600288,3438.9179617489949,3455.8584443191871,3472.8823775424353,3489.9901725056984,3507.1822423209983,3524.4590021353874,3541.8208691409814,3559.2682625850257,3576.8016037800262,3594.4213161139173,3612.1278250602936,3629.9215581886688,3647.8029451748216,3665.7724178111498,3683.8304100171176,3701.9773578497152,3720.213699513999,3738.539875373674,3756.9563279617232,3775.4635019910916,3794.0618443654325,3812.751804189892,3831.5338327819618,3850.4083836823656,3869.3759126660234,3888.4368777530485,3907.5917392198139,3926.8409596100582,3946.1850037460708,3965.6243387398931,3985.1594340046227,4004.79076126573,4024.5187945724583,4044.3440103092685,4064.2668872073441,4084.2879063561495,4104.4075512150484,4124.6263076249743,4144.9446638201716,4165.3631104399765,4185.8821405406661,4206.5022496073689,4227.2239355660286,4248.0476987954171,4268.974042139238,4290.0034709182473,4311.1364929424772,4332.3736185234757,4353.7153604866453,4375.1622341836246,4396.7147575047275,4418.3734508914504,4440.1388373490454,4462.0114424591375,4483.9917943924356,4506.0804239214631,4528.2778644333921,4550.5846519429151,4573.0013251051978,4595.5284252288684,4618.1664962891109,4640.9160849407808,4663.7777405316237,4686.7520151155231,4709.8394634658471,4733.0406430888324,4756.3561142370536,4779.7864399229502,4803.3321859324251,4826.9939208384958,4850.7722160150406,4874.6676456505838,4898.6807867621628,4922.8122192092678,4947.0625257078382,4971.4322918443295,4995.922106089869,5020.5325598144491,5045.2642473012229,0,"","","","","","","","","","","","","","","","","","","","","","","","","","","","","","","","","","","","","","","","","","","","","","","","","","","","","","","","","","","","","","","","","","","","","","","","","","","","","","","","",null,0,"","","","","","","","","","","","","","","","","","","","","","","","","","","","","","","","","","","","","","","","","","","","","","","","","","","","","","","","","","","","","","","","","","","","","","","","","","","","","","","","",195678.2801866323,3460.9475721323015,3477.9965749506878,3495.1295630046325,3512.3469500145079,3529.6491517387176,3547.036585983737,3564.5096726141983,3582.0688335630375,3599.7144928416737,3617.4470765502542,3635.2670128879395,3653.1747321632515,3671.1706668044499,3689.2552513699898,3707.4289225590041,3725.692119221857,3744.0452823707342,3762.4888551902941,3781.0232830483747,3799.6490135067429,3818.3664963318993,3837.1761835059492,3856.0785292375049,3875.0739899726659,3894.1630244060284,3913.3460934917744,3932.6236604547871,3951.9961908018577,3971.4641523328996,3991.0280151522761,4010.6882516801188,4030.4453366637658,4050.299747189204,4070.2519626925996,4090.3024649718736,4110.451738198336,4130.7002689283781,4151.0485461152193,4171.4970611207118,4192.0463077272198,4212.6967821495209,4233.4489830468101,4254.3034115347245,4275.2605711974602,4296.3209680999098,4317.4851107999111,4338.7535103605005,4360.1266803622784,4381.6051369157885,4403.1893986739933,4424.8799868448014,4446.6774252036448,4468.5822401061259,4490.594960500739,4512.716117941628,4534.9462466014393,4557.2858832842066,4579.735567438317,4602.2958411695399,4624.9672492541204,4647.7503391519231,4670.6456610196683,4693.6537677241986,4716.7752148558466,4740.0105607418363,4763.3603664597767,4786.8251958512046,4810.4056155352018,4834.1021949220749,4857.9155062271111,4881.8461244843875,4905.8946275606668,4930.0615961693402,4954.3476138844608,4978.753267154827,5003.2791453181544,5027.9258406152876,5052.6939482045264,5077.5840661759767,5102.596795566009,0,"","","","","","","","","","","","","","","","","","","","","","","","","","","","","","","","","","","","","","","","","","","","","","","","","","","","","","","","","","","","","","","","","","","","","","","","","","","","","","","",""]
[18,null,null,null,470,"470: Nutzungsspezifische Anlagen","Ja","Nein",null,142000,139464.28571428571,139464.28571428571,1,"pschl.",142000,0,0,0,1,470,25,"470-001: Abfallentsorgungsanlagen (Anlage 3/ AMEV)  [ND: 25]",25,"Nein",null,470,2231.4285714285716,1952.5,4183.9285714285716,"470-111: Abfallentsorgungsanlagen (Anlage 3/ AMEV)  [IW: 0,016, IN: 0,014]",1.6E-2,1.4E-2,"Nein",null,null,0,139464.28571428571,0,0,139464.28571428571,0,0,2231.4285714285716,0,0,1952.5,0,49.42681739650623,395414.53917204984,null,null,0,"","","","","","","","","","","","","","","","","","","","","","","","",0,"","","","","","","","","","","","","","","","","","","","","","","","","","","","","","","","","","","","","","","","","","","","","","","","","","","","","","","",157694.3904253853,"","","","","","","","","","","","","","","","","","","","","","","","",157694.3904253853,"","","","","","","","","","","","","","","","","","","","","","","","","","","","","","","","","","","","","","","","","","","","","","","","","","","","","","","",0,"","","","","","","","","","","","","","","","","","","","","","","","",0,"","","","","","","","","","","","","","","","","","","","","","","","","","","","","","","","","","","","","","","","","","","","","","","","","","","","","","","",null,0,"",{"$f":"IF(AND(ISNUMBER($AP29),$AP29<>0),$AP29*POWER(1+PSBNB,KL$8)*POWER(1+KALBNB,-KL$8),\"\")","v":""},"","","","","","","","","","","","","","","","","","","","","","","","","","","","","","","","","","","","","","","","","","","","","","","","","","","","","","","","","","","","","","","","","","","","","","","","","","","","","","",126784.07933155444,2242.4208304011263,2253.4672384326595,2264.568062267303,2275.7235699632015,2286.9340308989813,2298.1997157802575,2309.5208966461701,2320.8978468759547,2332.3308411955404,2343.8201556841891,2355.3660677811554,2366.9688562923934,2378.6288013972826,2390.3461846553978,2402.1212890133061,2413.9543988114015,2425.8457997907685,2437.7957791000827,2449.8046253025464,2461.8726283828551,2474.0000797541998,2486.1872722653047,2498.4345002074979,2510.7420593218208,2523.1102468061654,2535.5393613224524,2548.0297030038437,2560.5815734619919,2573.1952757943163,2585.8711145913339,2598.609395944,2611.4104274511142,2624.2745182267358,2637.2019789076562,2650.1931216608959,2663.2482601912452,2676.3677097488385,2689.5517871367642,2702.8008107187188,2716.1151004266931,2729.494977768697,2742.940765836523,2756.4527893135505,2770.0313744825844,2783.6768492337296,2797.3895430723205,2811.169787126863,2825.0179141570461,2838.9342585617615,2852.9191563871887,2866.9729453349082,2881.095964770057,2895.2885557295153,2909.5510609301546,2923.8838247771,2938.2871933720621,2952.7615145216782,2967.3071377459241,2981.9244142865441,2996.6136971155429,3011.3753409436977,3026.2097022291359,3041.1171391859293,3056.0980117927575,3071.1526818015896,3086.2815127464251,3101.4848699520726,3116.7631205429702,3132.116633452049,3147.5457794296467,3163.0509310524526,3178.6324627325148,3194.2907507262712,3210.0261731436422,3225.8391099571572,3241.7299430111352,3257.6990560308946,3273.7468346320325,3289.8736663297268,3306.0799405481016,0,"","","","","","","","","","","","","","","","","","","","","","","","","","","","","","","","","","","","","","","","","","","","","","","","","","","","","","","","","","","","","","","","","","","","","","","","","","","","","","","","",null,0,"","","","","","","","","","","","","","","","","","","","","","","","","","","","","","","","","","","","","","","","","","","","","","","","","","","","","","","","","","","","","","","","","","","","","","","","","","","","","","","","",110936.06941511013,1962.1182266009855,1971.783833628577,1981.4970544838902,1991.2581237178015,2001.0672770366084,2010.924751307725,2020.8307845653987,2030.7856160164602,2040.7894860460983,2050.8426362236651,2060.9453093085108,2071.0977492558445,2081.300201222622,2091.552911573473,2101.8561278866423,2112.2100989599762,2122.6150748169225,2133.0713067125721,2143.5790471397277,2154.1385498349982,2164.7500697849246,2175.4138632321415,2186.1301876815605,2196.8993019065933,2207.7214659553943,2218.5969411571459,2229.525990128363,2240.5088767792427,2251.5458663200266,2262.6372252674169,2273.7832214510004,2284.9841240197247,2296.2402034483939,2307.5517315441989,2318.9189814532842,2330.3422276673396,2341.8217460302335,2353.3578137446689,2364.9507093788789,2376.6007128733563,2388.3081055476096,2400.0731701069576,2411.8961906493569,2423.7774526722615,2435.7172430795135,2447.7158501882805,2459.7735637360051,2471.8906748874151,2484.067476241541,2496.3042618387899,2508.6013271680449,2520.9589691737997,2533.3774862633259,2545.8571783138855,2558.3983466799627,2571.0012942005542,2583.6663252064686,2596.3937455276832,2609.1838625007258,2622.0369849761,2634.9534233257359,2647.9334894504937,2660.9774967876883,2674.0857603186632,2687.2585965763906,2700.4963236531216,2713.7992612080639,2727.1677304750988,2740.6020542705428,2754.1025570009406,2767.6695646708959,2781.3034048909503,2795.0044068854872,2808.7729015006867,2822.6092212125127,2836.5137001347434,2850.4866740270322,2864.5284803030281,2878.6394580385108,2892.8199479795885,0,"","","","","","","","","","","","","","","","","","","","","","","","","","","","","","","","","","","","","","","","","","","","","","","","","","","","","","","","","","","","","","","","","","","","","","","","","","","","","","","",""]
[19,null,null,null,480,"480: Gebäudeautomation","Ja","Nein",null,264000,259285.71428571426,259285.71428571426,1,"pschl.",264000,0,0,0,4,480,10,"480-001: Gebäudeautomation (FAQ)  [ND: 10]",10,"Nein",null,480,3007.7142857142853,1970.5714285714284,4978.2857142857138,"480-111: Gebäudeautomation (FAQ)  [IW: 0,0116, IN: 0,0076]",1.1599999999999999E-2,7.6E-3,"Nein",null,null,0,259285.71428571426,0,0,259285.71428571426,0,0,3007.7142857142853,0,0,1970.5714285714284,0,182.16716533198948,1457337.3226559157,null,null,0,"","","","","","","","","",0,"","","","","","","","","",0,"","","","","","","","","",0,"","","","","","","","","",0,"","","","","","","","","","","","","","","","","","","","","","","",{"$f":"IF(AND(MOD(DL$8,$U30)=0,DL$8<BZBNB),$AM30*POWER(1+PSBNB,(DL$8))*POWER(1+KALBNB,-(DL$8)),\"\")","v":""},"","","","","","","","","","","","","","","","",1174483.8273584764,"","","","","","","","","",272345.29978020501,"","","","","","","","","",286062.66456561338,"","","","","","","","","",300470.93937152816,"","","","","","","","","",315604.92364112986,"","","","","","","","","","","","","","","","","","","","","","","","","","","","","","","","","","","","","","","","",0,"","","","","","","","","",0,"","","","","","","","","",0,"","","","","","","","","",0,"","","","","","","","","",0,"","","","","","","","","","","","","","","","","","","","","","","",{"$f":"IF(AND(MOD(JR$8,$U30)=0,JR$8<BZBNB),$AO30*POWER(1+PSBNB,JR$8)*POWER(1+KALBNB,-JR$8),\"\")","v":""},"","","","","","","","","","","","","","","","",null,0,"","","","","","","","","","","","","","","","","","","","","","","","","","","","","","","","","","","","","","","","","","","","","","","","","","","","","","","","","","","","","","","","","","","","","","","","","","","","","","","","",170890.65340886975,3022.5306122448983,3037.4199256057109,3052.3825853377584,3067.4189527532162,3082.5293909441193,3097.7142647911355,3112.9739409723725,3128.3087879722366,3143.719176090327,3159.2054774503786,3174.7680660092469,3190.4073175659441,3206.1236097707024,3221.9173221341061,3237.788836036244,3253.7385347359309,3269.7668033799509,3285.8740290123637,3302.060600583854,3318.3269089611154,3334.6733469362935,3351.1003092364731,3367.6081925332046,3384.1973954520877,3400.8683185823934,3417.6213644867416,3434.4569377108137,3451.3754447931351,3468.3772942748733,3485.4628967097269,3502.6326646738139,3519.8870127756563,3537.2263576661776,3554.6511180487701,3572.1617146894041,3589.7585704267904,3607.4421101825887,3625.2127609716667,3643.0709519124134,3661.0171142371059,3679.0516813023137,3697.1750885993697,3715.3877737648836,3733.6901765913135,3752.0827390375757,3770.5659052397327,3789.1401215217011,3807.8058364060453,3826.5635006247958,3845.4135671303361,3864.3564911063477,3883.3927299787947,3902.5227434269659,3921.7469933945881,3941.0659441009639,3960.480062052201,3979.9898160524585,3999.5956772152795,4019.2981189749607,4039.0976170979916,4058.9946496945331,4078.9896972299753,4099.083242536527,{"$f":"IF(AND(ISNUMBER($AQ30),$AQ30<>0),$AQ30*POWER(1+PSBNB,PY$8)*POWER(1+KALBNB,-PY$8),\"\")","v":4119.2757708248855},4139.5677696959447,4159.9597291525752,4180.4521416114558,4201.0455019149604,4221.7403073431133,4242.5370576255928,4263.4362549537982,4284.4384039929801,4305.5440118944234,4326.7535883076971,4348.0676453929564,4369.4866978333184,4391.0112628472752,4412.6418602012036,4434.3790122218988,4456.2232438092014,0,"","","","","","","","","","","","","","","","","","","","","","","","","","","","","","","","","","","","","","","","","","","","","","","","","","","","","","","","","","","","","","","",{"$f":"IF(AND(ISNUMBER($AR30),$AR30<>0),$AR30*POWER(1+PSBNB,TB$8)*POWER(1+KALBNB,-TB$8),\"\")","v":""},"","","","","","","","","","","","","","","","",null,0,"","","","","","","","","","","","","","","","","","","","","","","","","","","","","","","","","","","","","","","","","","","","","","","","","","","","","","","","","","","","","","","",{"$f":"IF(AND(ISNUMBER($AS30),$AS30<>0),$AS30*POWER(1+PSBNB,WF$8)*POWER(1+KALBNB,-WF$8),\"\")","v":""},"","","","","","","","","","","","","","","","",111962.84188856986,1980.2786769880368,1990.0337443623625,1999.8368662557732,2009.6882793900384,2019.5882216530438,2029.5369321045371,2039.5346509818992,2049.5816197059485,2059.6780808867661,2069.8242783295586,2080.0204570405413,2090.26686323286,2100.5637443325295,2110.9113489844144,2121.3099270582288,2131.759729654575,2142.2610091110023,2152.8140190081008,2163.4190141756285,2174.0762506986621,2184.7859859237788,2195.5484784652758,2206.3639882114098,2217.2327763306785,2228.1551052781201,2239.1312388016586,2250.1614419484645,2261.2459810713644,2272.3851238352622,2283.5791392236142,2294.8282975449129,2306.1328704392231,2317.4931308847372,2328.9093532043667,2340.3818130723685,2351.9107875210011,2363.4965549472136,2375.1393951193677,2386.839589183995,2398.597419672587,2410.4131705084128,2422.2871270133801,2434.219575914924,2446.2108053529296,2458.2611048866875,2470.3707655018943,2482.5400796176664,2494.7693410936163,2507.0588452369357,2519.4088888095307,2531.8197700351934,2544.2917886067967,2556.8252456935297,2569.4204439481782,2582.0776875144247,2594.7972820342011,2607.5795346550594,2620.4247540375973,2633.3332503629053,2646.3053353400637,2659.3413222136596,2672.4415257713636,2685.6062623515177,{"$f":"IF(AND(ISNUMBER($AT30),$AT30<>0),$AT30*POWER(1+PSBNB,ZI$8)*POWER(1+KALBNB,-ZI$8),\"\")","v":2698.8358498507873},2712.1306077318259,2725.4908570309976,2738.9169203661259,2752.4091219442848,2765.9677875696261,2779.5932446512511,2793.285822211109,2807.0458508919523,2820.8736629653117,2834.7695923395258,2848.7339745677991,2862.7671468563121,2876.869448072353,2891.0412187525126,2905.2828011108991,2919.594539047408,0,"","","","","","","","","","","","","","","","","","","","","","","","","","","","","","","","","","","","","","","","","","","","","","","","","","","","","","","","","","","","","","","",{"$f":"IF(AND(ISNUMBER($AU30),$AU30<>0),$AU30*POWER(1+PSBNB,ACL$8)*POWER(1+KALBNB,-ACL$8),\"\")","v":""},"","","","","","","","","","","","","","","",""]
[20,null,null,null,490,"490: Sonstige Maßnahmen für technische Anlagen","Ja","Nein",null,68000,66785.714285714275,66785.714285714275,1,"pschl.",68000,0,0,0,1,490,25,"490-001: Sonstige Maßnahmen für Technische Anlagen (FAQ)  [ND: 25]",25,"Nein",null,490,333.92857142857139,333.92857142857139,667.85714285714278,"490-111: Sonstige Maßnahmen für Technische Anlagen (FAQ)  [IW: 0,005, IN: 0,005]",5.0000000000000001E-3,5.0000000000000001E-3,"Nein",null,null,0,66785.714285714275,0,0,66785.714285714275,0,0,333.92857142857139,0,0,333.92857142857139,0,14.182695352568011,113461.56282054409,null,null,0,{"$f":"IF(AND(MOD(BA$8,$U31)=0,BA$8<BZBNB),$AM31*POWER(1+PSBNB,(BA$8))*POWER(1+KALBNB,-(BA$8)),\"\")","v":""},"","","","","","","","","","","","","","","","","","","","","","","",0,"","","","","","","","","","","","","","","","","","","","","","","","","","","","","","","","","","","","","","","","","","","","","","","","","","","","","","","",75515.623583987326,"","","","","","","","","","","","","","","","","","","","","","","","",75515.623583987326,"","","","","","","","","","","","","","","","","","","","","","","","","","","","","","","","","","","","","","",{"$f":"IF(AND(MOD(GO$8,$U31)=0,GO$8<BZBNB),$AN31*POWER(1+PSBNB,(GO$8))*POWER(1+KALBNB,-(GO$8)),\"\")","v":""},"","","","","","","","","","","","","","","","",0,{"$f":"IF(AND(MOD(HG$8,$U31)=0,HG$8<BZBNB),$AO31*POWER(1+PSBNB,HG$8)*POWER(1+KALBNB,-HG$8),\"\")","v":""},"","","","","","","","","","","","","","","","","","","","","","","",0,"","","","","","","","","","","","","","","","","","","","","","","","","","","","","","","","","","","","","","","","","","","","","","","","","","","","","","","",null,0,"","","","","","","","","","","","","","","","","","","","","","","","","","","","","","","","","","","","","","","","","","","","","","","","","","","","","","","","","","","","","","","","","","","","","","","","","","","","","","","","",18972.969618278388,{"$f":"IF(AND(ISNUMBER($AQ31),$AQ31<>0),$AQ31*POWER(1+PSBNB,NN$8)*POWER(1+KALBNB,-NN$8),\"\")","v":335.57353976073188},337.22661138516901,338.88782621957876,340.55722437829598,342.23484617326301,343.92073211500326,345.61492291359934,347.31745947967624,349.02838292538894,350.74773456541556,352.47555591795452,354.21188870572786,355.95677485698764,357.7102565065295,359.47237599670945,361.24317587846673,363.0226989123509,364.81098806955453,366.6080865329514,368.41403769813849,370.22888517448399,372.05267278618106,373.88544457330505,375.72724479287808,377.57811791993657,379.43810864860632,381.30726189318079,383.18562278920649,385.0732366945719,386.97014919060445,388.876406083169,390.79205340377581,392.71713741069107,394.65170459005407,396.59580165700027,398.54947555678842,400.51277346593525,402.48574279335378,404.46843118149837,406.46088650751568,408.46315688440001,410.47529066215571,412.49733642896439,414.52934301235848,416.57135948039956,418.62343514286482,420.68561955243547,422.75796250589582,424.84051404533386,426.93332445935027,429.03644428427316,431.14992430537819,433.27381555811405,435.40816932933643,437.55303715854484,439.70847083912889,441.87452241961734,444.0512442049357,446.23868875766931,448.43690889933299,450.64595771164488,452.86588853781075,455.09675498380983,457.33861091969072,459.59151048087153,461.85550806944735,464.13065835550373,466.41701627843736,468.71463704828193,471.02357614704209,473.34388933003243,475.67563262722479,478.01886234460028,480.37363506550975,482.74000765203931,485.11803724638463,487.50778127222884,489.90929743613151,492.3226437289203,494.74787842709259,0,{"$f":"IF(AND(ISNUMBER($AR31),$AR31<>0),$AR31*POWER(1+PSBNB,QQ$8)*POWER(1+KALBNB,-QQ$8),\"\")","v":""},"","","","","","","","","","","","","","","","","","","","","","","","","","","","","","","","","","","","","","","","","","","","","","","","","","","","","","","","","","","","","","","","","","","","","","","","","","","","","","","",null,0,{"$f":"IF(AND(ISNUMBER($AS31),$AS31<>0),$AS31*POWER(1+PSBNB,TU$8)*POWER(1+KALBNB,-TU$8),\"\")","v":""},"","","","","","","","","","","","","","","","","","","","","","","","","","","","","","","","","","","","","","","","","","","","","","","","","","","","","","","","","","","","","","","","","","","","","","","","","","","","","","","",18972.969618278388,{"$f":"IF(AND(ISNUMBER($AT31),$AT31<>0),$AT31*POWER(1+PSBNB,WX$8)*POWER(1+KALBNB,-WX$8),\"\")","v":335.57353976073188},337.22661138516901,338.88782621957876,340.55722437829598,342.23484617326301,343.92073211500326,345.61492291359934,347.31745947967624,349.02838292538894,350.74773456541556,352.47555591795452,354.21188870572786,355.95677485698764,357.7102565065295,359.47237599670945,361.24317587846673,363.0226989123509,364.81098806955453,366.6080865329514,368.41403769813849,370.22888517448399,372.05267278618106,373.88544457330505,375.72724479287808,377.57811791993657,379.43810864860632,381.30726189318079,383.18562278920649,385.0732366945719,386.97014919060445,388.876406083169,390.79205340377581,392.71713741069107,394.65170459005407,396.59580165700027,398.54947555678842,400.51277346593525,402.48574279335378,404.46843118149837,406.46088650751568,408.46315688440001,410.47529066215571,412.49733642896439,414.52934301235848,416.57135948039956,418.62343514286482,420.68561955243547,422.75796250589582,424.84051404533386,426.93332445935027,429.03644428427316,431.14992430537819,433.27381555811405,435.40816932933643,437.55303715854484,439.70847083912889,441.87452241961734,444.0512442049357,446.23868875766931,448.43690889933299,450.64595771164488,452.86588853781075,455.09675498380983,457.33861091969072,459.59151048087153,461.85550806944735,464.13065835550373,466.41701627843736,468.71463704828193,471.02357614704209,473.34388933003243,475.67563262722479,478.01886234460028,480.37363506550975,482.74000765203931,485.11803724638463,487.50778127222884,489.90929743613151,492.3226437289203,494.74787842709259,0,{"$f":"IF(AND(ISNUMBER($AU31),$AU31<>0),$AU31*POWER(1+PSBNB,AAA$8)*POWER(1+KALBNB,-AAA$8),\"\")","v":""},"","","","","","","","","","","","","","","","","","","","","","","","","","","","","","","","","","","","","","","","","","","","","","","","","","","","","","","","","","","","","","","","","","","","","","","","","","","","","","",""]
[21,null,null,null,"k.A.",null,"Ja","Nein",null,0,0,0,null,null,null,0,0,0,49,"",1,null,"","Nein",null,"",0,0,0,null,0,0,"Nein",null,null,0,0,0,0,0,0,0,0,0,0,0,0,0,0,null,null,0,0,0,0,0,0,0,0,0,0,0,0,0,0,0,0,0,0,0,0,0,0,0,0,0,0,0,0,0,0,0,0,0,0,0,0,0,0,0,0,0,0,0,0,0,0,0,0,0,0,"","","","","","","","","","","","","","","","","","","","","","","","","","","","","","","",0,{"$f":"IF(AND(MOD(ED$8,$U32)=0,ED$8<BZBNB),$AN32*POWER(1+PSBNB,(ED$8))*POWER(1+KALBNB,-(ED$8)),\"\")","v":0},0,0,0,0,0,0,0,0,0,0,0,0,0,0,0,0,0,0,0,0,0,0,0,0,0,0,0,0,0,0,0,0,0,0,0,0,0,0,0,0,0,0,0,0,0,0,0,0,"","","","","","","","","","","","","","","","","","","","","","","","","","","","","","","",0,0,0,0,0,0,0,0,0,0,0,0,0,0,0,0,0,0,0,0,0,0,0,0,0,0,0,0,0,0,0,0,0,0,0,0,0,0,0,0,0,0,0,0,0,0,0,0,0,0,"","","","","","","","","","","","","","","","","","","","","","","","","","","","","","","",null,0,"","","","","","","","","","","","","","","","","","","","","","","","","","","","","","","","","","","","","","","","","","","","","","","",{"$f":"IF(AND(ISNUMBER($AP32),$AP32<>0),$AP32*POWER(1+PSBNB,MF$8)*POWER(1+KALBNB,-MF$8),\"\")","v":""},"","","","","","","","","","","","","","","","","","","","","","","","","","","","","","","","",0,"","","","","","","","","","","","","","","","","","","","","","","","","","","","","","","","","","","","","","","","","","","","","","","","","","","","","","","","","","","","","","","","","","","","","","","","","","","","","","","","",0,"","","","","","","","","","","","","","","","","","","","","","","","","","","","","","","","","","","","","","","","","","","","","","","","","","","","","","","","","","","","","","","","","","","","","","","","","","","","","","","","",null,0,"","","","","","","","","","","","","","","","","","","","","","","","","","","","","","","","","","","","","","","","","","","","","","","","","","","","","","","","","","","","","","","","","","","","","","","","","","","","","","","","",0,"","","","","","","","","","","","","","","","","","","","","","","","","","","","","","","","","","","","","","","","","","","","","","","","","","","","","","","","","","","","","","","","","","","","","","","","","","","","","","","","",0,"","","","","","","","","","","","","","","","","","","","","","","","","","","","","","","","","","","","","","","","","","","","","","","","","","","","","","","","","","","","","","","","","","","","","","","","","","","","","","","",""]
[22,null,null,null,500,"500: Außenanlagen","Ja","Nein",null,0,0,0,null,null,null,0,0,0,49,"",1,null,"","Nein",null,"",0,0,0,null,0,0,"Nein",null,null,0,0,0,0,0,0,0,0,0,0,0,0,0,0,null,null,0,0,0,0,0,0,0,0,0,0,0,0,0,0,0,0,0,0,0,0,0,0,0,0,0,0,0,0,0,0,0,0,0,0,0,0,0,0,0,0,0,0,0,0,0,0,0,0,0,0,"","","","","","","","","","","","","","","","","","","","","","","","","","","","","","","",0,0,0,0,0,0,0,0,0,0,0,0,0,0,0,0,0,0,0,0,0,0,0,0,0,0,0,0,0,0,0,0,0,0,0,0,0,0,0,0,0,0,0,0,0,0,0,0,0,0,"","","","","","","","","","","","","","","","","","","","","","","","","","","","","","","",0,0,0,0,0,0,0,0,0,0,0,0,0,0,0,0,0,0,0,0,0,0,0,0,0,0,0,0,0,0,0,0,0,0,0,0,0,0,0,0,0,0,0,0,0,0,0,0,0,0,"","","","","","","","","","","","","","","","","","","","","","","","","","","","","","","",null,0,"","","","","","","","","","","","","","","","","","","","","","","","","","","","","","","","",{"$f":"IF(AND(ISNUMBER($AP33),$AP33<>0),$AP33*POWER(1+PSBNB,LQ$8)*POWER(1+KALBNB,-LQ$8),\"\")","v":""},"","","","","","","","","","","","","","","","","","","","","","","","","","","","","","","","","","","","","","","","","","","","","","","",0,"","","","","","","","","","","","","","","","","","","","","","","","","","","","","","","","","","","","","","","","","","","","","","","","","","","","","","","","","","","","","","","","","","","","","","","","","","","","","","","","",0,"","","","","","","","","","","","","","","","","","","","","","","","","","","","","","","","","","","","","","","","","","","","","","","","","","","","","","","","","","","","","","","","","","","","","","","","","","","","","","","","",null,0,"","","","","","","","","","","","","","","","","","","","","","","","","","","","","","","","","","","","","","","","","","","","","","","","","","","","","","","","","","","","","","","","","","","","","","","","","","","","","","","","",0,"","","","","","","","","","","","","","","","","","","","","","","","","","","","","","","","","","","","","","","","","","","","","","","","","","","","","","","","","","","","","","","","","","","","","","","","","","","","","","","","",0,"","","","","","","","","","","","","","","","","","","","","","","","","","","","","","","","","","","","","","","","","","","","","","","","","","","","","","","","","","","","","","","","","","","","","","","","","","","","","","","",""]
[23,null,null,null,510,"510: Geländeflächen","Ja","Nein",null,0,0,0,null,null,null,0,0,0,49,"",1,null,"","Nein",null,"",0,0,0,null,0,0,"Nein",null,null,0,0,0,0,0,0,0,0,0,0,0,0,0,0,null,null,0,0,0,0,0,0,0,0,0,0,0,0,0,0,0,0,0,0,0,0,0,0,0,0,0,0,0,0,0,0,0,0,0,0,0,0,0,0,0,0,0,0,0,0,0,0,0,0,0,0,"","","","","","","","","","","","","","",{"$f":"IF(AND(MOD(DL$8,$U34)=0,DL$8<BZBNB),$AM34*POWER(1+PSBNB,(DL$8))*POWER(1+KALBNB,-(DL$8)),\"\")","v":""},"","","","","","","","","","","","","","","","",0,0,0,0,0,0,0,0,0,0,0,0,0,0,0,0,0,0,0,0,0,0,0,0,0,0,0,0,0,0,0,0,0,0,0,0,0,0,0,0,0,0,0,0,0,0,0,0,0,0,"","","","","","","","","","","","","","","","","","","","","","","","","","","","","","","",0,0,0,0,0,0,0,0,0,0,0,0,0,0,0,0,0,0,0,0,0,0,0,0,0,0,0,0,0,0,0,0,0,0,0,0,0,0,0,0,0,0,0,0,0,0,0,0,0,0,"","","","","","","","","","","","","","",{"$f":"IF(AND(MOD(JR$8,$U34)=0,JR$8<BZBNB),$AO34*POWER(1+PSBNB,JR$8)*POWER(1+KALBNB,-JR$8),\"\")","v":""},"","","","","","","","","","","","","","","","",null,0,"","","","","","","","","","","","","","","","","","","","","","","","","","","","","","","","","","","","","","","","","","","","","","","","","","","","","","","","","","","","","","","","","","","","","","","","","","","","","","","","",0,"","","","","","","","","","","","","","","","","","","","","","","","","","","","","","","","","","","","","","","","","","","","","","","","","","","","","","","","","","","","","","","",{"$f":"IF(AND(ISNUMBER($AQ34),$AQ34<>0),$AQ34*POWER(1+PSBNB,PY$8)*POWER(1+KALBNB,-PY$8),\"\")","v":""},"","","","","","","","","","","","","","","","",0,"","","","","","","","","","","","","","","","","","","","","","","","","","","","","","","","","","","","","","","","","","","","","","","","","","","","","","","","","","","","","","","",{"$f":"IF(AND(ISNUMBER($AR34),$AR34<>0),$AR34*POWER(1+PSBNB,TB$8)*POWER(1+KALBNB,-TB$8),\"\")","v":""},"","","","","","","","","","","","","","","","",null,0,"","","","","","","","","","","","","","","","","","","","","","","","","","","","","","","","","","","","","","","","","","","","","","","","","","","","","","","","","","","","","","","",{"$f":"IF(AND(ISNUMBER($AS34),$AS34<>0),$AS34*POWER(1+PSBNB,WF$8)*POWER(1+KALBNB,-WF$8),\"\")","v":""},"","","","","","","","","","","","","","","","",0,"","","","","","","","","","","","","","","","","","","","","","","","","","","","","","","","","","","","","","","","","","","","","","","","","","","","","","","","","","","","","","","",{"$f":"IF(AND(ISNUMBER($AT34),$AT34<>0),$AT34*POWER(1+PSBNB,ZI$8)*POWER(1+KALBNB,-ZI$8),\"\")","v":""},"","","","","","","","","","","","","","","","",0,"","","","","","","","","","","","","","","","","","","","","","","","","","","","","","","","","","","","","","","","","","","","","","","","","","","","","","","","","","","","","","","",{"$f":"IF(AND(ISNUMBER($AU34),$AU34<>0),$AU34*POWER(1+PSBNB,ACL$8)*POWER(1+KALBNB,-ACL$8),\"\")","v":""},"","","","","","","","","","","","","","","",""]
[24,null,null,null,520,"520: Befestigte Flächen","Ja","Nein",null,0,0,0,null,null,null,0,0,0,49,"",1,null,"","Nein",null,"",0,0,0,null,0,0,"Nein",null,null,0,0,0,0,0,0,0,0,0,0,0,0,0,0,null,null,0,{"$f":"IF(AND(MOD(BA$8,$U35)=0,BA$8<BZBNB),$AM35*POWER(1+PSBNB,(BA$8))*POWER(1+KALBNB,-(BA$8)),\"\")","v":0},0,0,0,0,0,0,0,0,0,0,0,0,0,0,0,0,0,0,0,0,0,0,0,0,0,0,0,0,0,0,0,0,0,0,0,0,0,0,0,0,0,0,0,0,0,0,0,0,"","","","","","","","","","","","","","","","","","","","","","","","","","","","","","","",0,0,0,0,0,0,0,0,0,0,0,0,0,0,0,0,0,0,0,0,0,0,0,0,0,0,0,0,0,0,0,0,0,0,0,0,0,0,0,0,0,0,0,0,0,0,0,0,0,0,"","","","","","","","","","","","","","",{"$f":"IF(AND(MOD(GO$8,$U35)=0,GO$8<BZBNB),$AN35*POWER(1+PSBNB,(GO$8))*POWER(1+KALBNB,-(GO$8)),\"\")","v":""},"","","","","","","","","","","","","","","","",0,{"$f":"IF(AND(MOD(HG$8,$U35)=0,HG$8<BZBNB),$AO35*POWER(1+PSBNB,HG$8)*POWER(1+KALBNB,-HG$8),\"\")","v":0},0,0,0,0,0,0,0,0,0,0,0,0,0,0,0,0,0,0,0,0,0,0,0,0,0,0,0,0,0,0,0,0,0,0,0,0,0,0,0,0,0,0,0,0,0,0,0,0,"","","","","","","","","","","","","","","","","","","","","","","","","","","","","","","",null,0,"","","","","","","","","","","","","","","","","","","","","","","","","","","","","","","","","","","","","","","","","","","","","","","","","","","","","","","","","","","","","","","","","","","","","","","","","","","","","","","","",0,{"$f":"IF(AND(ISNUMBER($AQ35),$AQ35<>0),$AQ35*POWER(1+PSBNB,NN$8)*POWER(1+KALBNB,-NN$8),\"\")","v":""},"","","","","","","","","","","","","","","","","","","","","","","","","","","","","","","","","","","","","","","","","","","","","","","","","","","","","","","","","","","","","","","","","","","","","","","","","","","","","","","",0,{"$f":"IF(AND(ISNUMBER($AR35),$AR35<>0),$AR35*POWER(1+PSBNB,QQ$8)*POWER(1+KALBNB,-QQ$8),\"\")","v":""},"","","","","","","","","","","","","","","","","","","","","","","","","","","","","","","","","","","","","","","","","","","","","","","","","","","","","","","","","","","","","","","","","","","","","","","","","","","","","","","",null,0,{"$f":"IF(AND(ISNUMBER($AS35),$AS35<>0),$AS35*POWER(1+PSBNB,TU$8)*POWER(1+KALBNB,-TU$8),\"\")","v":""},"","","","","","","","","","","","","","","","","","","","","","","","","","","","","","","","","","","","","","","","","","","","","","","","","","","","","","","","","","","","","","","","","","","","","","","","","","","","","","","",0,{"$f":"IF(AND(ISNUMBER($AT35),$AT35<>0),$AT35*POWER(1+PSBNB,WX$8)*POWER(1+KALBNB,-WX$8),\"\")","v":""},"","","","","","","","","","","","","","","","","","","","","","","","","","","","","","","","","","","","","","","","","","","","","","","","","","","","","","","","","","","","","","","","","","","","","","","","","","","","","","","",0,{"$f":"IF(AND(ISNUMBER($AU35),$AU35<>0),$AU35*POWER(1+PSBNB,AAA$8)*POWER(1+KALBNB,-AAA$8),\"\")","v":""},"","","","","","","","","","","","","","","","","","","","","","","","","","","","","","","","","","","","","","","","","","","","","","","","","","","","","","","","","","","","","","","","","","","","","","","","","","","","","","",""]
[25,null,null,null,530,"530: Baukonstruktionen in Außenanlagen","Ja","Nein",null,0,0,0,null,null,null,0,0,0,49,"",1,null,"","Nein",null,"",0,0,0,null,0,0,"Nein",null,null,0,0,0,0,0,0,0,0,0,0,0,0,0,0,null,null,0,0,0,0,0,0,0,0,0,0,0,0,0,0,0,0,0,0,0,0,0,0,0,0,0,0,0,0,0,0,0,0,0,0,0,0,0,0,0,0,0,0,0,0,0,0,0,0,0,0,"","","","","","","","","","","","","","","","","","","","","","","","","","","","","","","",0,{"$f":"IF(AND(MOD(ED$8,$U36)=0,ED$8<BZBNB),$AN36*POWER(1+PSBNB,(ED$8))*POWER(1+KALBNB,-(ED$8)),\"\")","v":0},0,0,0,0,0,0,0,0,0,0,0,0,0,0,0,0,0,0,0,0,0,0,0,0,0,0,0,0,0,0,0,0,0,0,0,0,0,0,0,0,0,0,0,0,0,0,0,0,"","","","","","","","","","","","","","","","","","","","","","","","","","","","","","","",0,0,0,0,0,0,0,0,0,0,0,0,0,0,0,0,0,0,0,0,0,0,0,0,0,0,0,0,0,0,0,0,0,0,0,0,0,0,0,0,0,0,0,0,0,0,0,0,0,0,"","","","","","","","","","","","","","","","","","","","","","","","","","","","","","","",null,0,"","","","","","","","","","","","","","","","","","","","","","","","","","","","","","","","","","","","","","","","","","","","","","","","","","","","","","","","","","","","","","","","","","","","","","","","","","","","","","","","",0,"","","","","","","","","","","","","","","","","","","","","","","","","","","","","","","","","","","","","","","","","","","","","","","","","","","","","","","","","","","","","","","","","","","","","","","","","","","","","","","","",0,"","","","","","","","","","","","","","","","","","","","","","","","","","","","","","","","","","","","","","","","","","","","","","","","","","","","","","","","","","","","","","","","","","","","","","","","","","","","","","","","",null,0,"","","","","","","","","","","","","","","","","","","","","","","","","","","","","","","","","","","","","","","","","","","","","","","","","","","","","","","","","","","","","","","","","","","","","","","","","","","","","","","","",0,"","","","","","","","","","","","","","","","","","","","","","","","","","","","","","","","","","","","","","","","","","","","","","","","","","","","","","","","","","","","","","","","","","","","","","","","","","","","","","","","",0,"","","","","","","","","","","","","","","","","","","","","","","","","","","","","","","","","","","","","","","","","","","","","","","","","","","","","","","","","","","","","","","","","","","","","","","","","","","","","","","",""]
[26,null,null,null,540,"540: Technische Anlagen in Außenanlagen","Ja","Nein",null,0,0,0,null,null,null,0,0,0,49,"",1,null,"","Nein",null,"",0,0,0,null,0,0,"Nein",null,null,0,0,0,0,0,0,0,0,0,0,0,0,0,0,null,null,0,0,0,0,0,0,0,0,0,0,0,0,0,0,0,0,0,0,0,0,0,0,0,0,0,0,0,0,0,0,0,0,0,0,0,0,0,0,0,0,0,0,0,0,0,0,0,0,0,0,"","","","","","","","","","","","","","","","","","","","","","","","","","","","","","","",0,0,0,0,0,0,0,0,0,0,0,0,0,0,0,0,0,0,0,0,0,0,0,0,0,0,0,0,0,0,0,0,0,0,0,0,0,0,0,0,0,0,0,0,0,0,0,0,0,0,"","","","","","","","","","","","","","","","","","","","","","","","","","","","","","","",0,0,0,0,0,0,0,0,0,0,0,0,0,0,0,0,0,0,0,0,0,0,0,0,0,0,0,0,0,0,0,0,0,0,0,0,0,0,0,0,0,0,0,0,0,0,0,0,0,0,"","","","","","","","","","","","","","","","","","","","","","","","","","","","","","","",null,0,"","","","","","","","",{"$f":"IF(AND(ISNUMBER($AP37),$AP37<>0),$AP37*POWER(1+PSBNB,KS$8)*POWER(1+KALBNB,-KS$8),\"\")","v":""},"","","","","","","","","","","","","","","","","","","","","","","","","","","","","","","","","","","","","","","","","","","","","","","","","","","","","","","","","","","","","","","","","","","","","","","",0,"","","","","","","","","","","","","","","","","","","","","","","","","","","","","","","","","","","","","","","","","","","","","","","","","","","","","","","","","","","","","","","","","","","","","","","","","","","","","","","","",0,"","","","","","","","","","","","","","","","","","","","","","","","","","","","","","","","","","","","","","","","","","","","","","","","","","","","","","","","","","","","","","","","","","","","","","","","","","","","","","","","",null,0,"","","","","","","","","","","","","","","","","","","","","","","","","","","","","","","","","","","","","","","","","","","","","","","","","","","","","","","","","","","","","","","","","","","","","","","","","","","","","","","","",0,"","","","","","","","","","","","","","","","","","","","","","","","","","","","","","","","","","","","","","","","","","","","","","","","","","","","","","","","","","","","","","","","","","","","","","","","","","","","","","","","",0,"","","","","","","","","","","","","","","","","","","","","","","","","","","","","","","","","","","","","","","","","","","","","","","","","","","","","","","","","","","","","","","","","","","","","","","","","","","","","","","",""]
[27,null,null,null,550,"550: Einbauten in Außenanlagen","Ja","Nein",null,0,0,0,null,null,null,0,0,0,49,"",1,null,"","Nein",null,"",0,0,0,null,0,0,"Nein",null,null,0,0,0,0,0,0,0,0,0,0,0,0,0,0,null,null,0,0,0,0,0,0,0,0,0,0,0,0,0,0,0,0,0,0,0,0,0,0,0,0,0,0,0,0,0,0,0,0,0,0,0,0,0,0,0,0,0,0,0,0,0,0,0,0,0,0,"","","","","","","","","","","","","","",{"$f":"IF(AND(MOD(DL$8,$U38)=0,DL$8<BZBNB),$AM38*POWER(1+PSBNB,(DL$8))*POWER(1+KALBNB,-(DL$8)),\"\")","v":""},"","","","","","","","","","","","","","","","",0,0,0,0,0,0,0,0,0,0,0,0,0,0,0,0,0,0,0,0,0,0,0,0,0,0,0,0,0,0,0,0,0,0,0,0,0,0,0,0,0,0,0,0,0,0,0,0,0,0,"","","","","","","","","","","","","","","","","","","","","","","","","","","","","","","",0,0,0,0,0,0,0,0,0,0,0,0,0,0,0,0,0,0,0,0,0,0,0,0,0,0,0,0,0,0,0,0,0,0,0,0,0,0,0,0,0,0,0,0,0,0,0,0,0,0,"","","","","","","","","","","","","","",{"$f":"IF(AND(MOD(JR$8,$U38)=0,JR$8<BZBNB),$AO38*POWER(1+PSBNB,JR$8)*POWER(1+KALBNB,-JR$8),\"\")","v":""},"","","","","","","","","","","","","","","","",null,0,"",{"$f":"IF(AND(ISNUMBER($AP38),$AP38<>0),$AP38*POWER(1+PSBNB,KL$8)*POWER(1+KALBNB,-KL$8),\"\")","v":""},"","","","","","","","","","","","","","","","","","","","","","","","","","","","","","","","","","","","","","","","","","","","","","","","","","","","","","","","","","","","","","","","","","","","","","","","","","","","","","",0,"","","","","","","","","","","","","","","","","","","","","","","","","","","","","","","","","","","","","","","","","","","","","","","","","","","","","","","","","","","","","","","",{"$f":"IF(AND(ISNUMBER($AQ38),$AQ38<>0),$AQ38*POWER(1+PSBNB,PY$8)*POWER(1+KALBNB,-PY$8),\"\")","v":""},"","","","","","","","","","","","","","","","",0,"","","","","","","","","","","","","","","","","","","","","","","","","","","","","","","","","","","","","","","","","","","","","","","","","","","","","","","","","","","","","","","",{"$f":"IF(AND(ISNUMBER($AR38),$AR38<>0),$AR38*POWER(1+PSBNB,TB$8)*POWER(1+KALBNB,-TB$8),\"\")","v":""},"","","","","","","","","","","","","","","","",null,0,"","","","","","","","","","","","","","","","","","","","","","","","","","","","","","","","","","","","","","","","","","","","","","","","","","","","","","","","","","","","","","","",{"$f":"IF(AND(ISNUMBER($AS38),$AS38<>0),$AS38*POWER(1+PSBNB,WF$8)*POWER(1+KALBNB,-WF$8),\"\")","v":""},"","","","","","","","","","","","","","","","",0,"","","","","","","","","","","","","","","","","","","","","","","","","","","","","","","","","","","","","","","","","","","","","","","","","","","","","","","","","","","","","","","",{"$f":"IF(AND(ISNUMBER($AT38),$AT38<>0),$AT38*POWER(1+PSBNB,ZI$8)*POWER(1+KALBNB,-ZI$8),\"\")","v":""},"","","","","","","","","","","","","","","","",0,"","","","","","","","","","","","","","","","","","","","","","","","","","","","","","","","","","","","","","","","","","","","","","","","","","","","","","","","","","","","","","","",{"$f":"IF(AND(ISNUMBER($AU38),$AU38<>0),$AU38*POWER(1+PSBNB,ACL$8)*POWER(1+KALBNB,-ACL$8),\"\")","v":""},"","","","","","","","","","","","","","","",""]
[28,null,null,null,560,"560: Wasserflächen","Ja","Nein",null,0,0,0,null,null,null,0,0,0,49,"",1,null,"","Nein",null,"",0,0,0,null,0,0,"Nein",null,null,0,0,0,0,0,0,0,0,0,0,0,0,0,0,null,null,0,{"$f":"IF(AND(MOD(BA$8,$U39)=0,BA$8<BZBNB),$AM39*POWER(1+PSBNB,(BA$8))*POWER(1+KALBNB,-(BA$8)),\"\")","v":0},0,0,0,0,0,0,0,0,0,0,0,0,0,0,0,0,0,0,0,0,0,0,0,0,0,0,0,0,0,0,0,0,0,0,0,0,0,0,0,0,0,0,0,0,0,0,0,0,"","","","","","","","","","","","","","","","","","","","","","","","","","","","","","","",0,0,0,0,0,0,0,0,0,0,0,0,0,0,0,0,0,0,0,0,0,0,0,0,0,0,0,0,0,0,0,0,0,0,0,0,0,0,0,0,0,0,0,0,0,0,0,0,0,0,"","","","","","","","","","","","","","",{"$f":"IF(AND(MOD(GO$8,$U39)=0,GO$8<BZBNB),$AN39*POWER(1+PSBNB,(GO$8))*POWER(1+KALBNB,-(GO$8)),\"\")","v":""},"","","","","","","","","","","","","","","","",0,{"$f":"IF(AND(MOD(HG$8,$U39)=0,HG$8<BZBNB),$AO39*POWER(1+PSBNB,HG$8)*POWER(1+KALBNB,-HG$8),\"\")","v":0},0,0,0,0,0,0,0,0,0,0,0,0,0,0,0,0,0,0,0,0,0,0,0,0,0,0,0,0,0,0,0,0,0,0,0,0,0,0,0,0,0,0,0,0,0,0,0,0,"","","","","","","","","","","","","","","","","","","","","","","","","","","","","","","",null,0,"","","","","","","","","","","","","","","","","","","","","","","","","","","","","","","","","","","","","","","","","","","","","","","","","","","","","","","","","","","","","","","","","","","","","","","","","","","","","","","","",0,{"$f":"IF(AND(ISNUMBER($AQ39),$AQ39<>0),$AQ39*POWER(1+PSBNB,NN$8)*POWER(1+KALBNB,-NN$8),\"\")","v":""},"","","","","","","","","","","","","","","","","","","","","","","","","","","","","","","","","","","","","","","","","","","","","","","","","","","","","","","","","","","","","","","","","","","","","","","","","","","","","","","",0,{"$f":"IF(AND(ISNUMBER($AR39),$AR39<>0),$AR39*POWER(1+PSBNB,QQ$8)*POWER(1+KALBNB,-QQ$8),\"\")","v":""},"","","","","","","","","","","","","","","","","","","","","","","","","","","","","","","","","","","","","","","","","","","","","","","","","","","","","","","","","","","","","","","","","","","","","","","","","","","","","","","",null,0,{"$f":"IF(AND(ISNUMBER($AS39),$AS39<>0),$AS39*POWER(1+PSBNB,TU$8)*POWER(1+KALBNB,-TU$8),\"\")","v":""},"","","","","","","","","","","","","","","","","","","","","","","","","","","","","","","","","","","","","","","","","","","","","","","","","","","","","","","","","","","","","","","","","","","","","","","","","","","","","","","",0,{"$f":"IF(AND(ISNUMBER($AT39),$AT39<>0),$AT39*POWER(1+PSBNB,WX$8)*POWER(1+KALBNB,-WX$8),\"\")","v":""},"","","","","","","","","","","","","","","","","","","","","","","","","","","","","","","","","","","","","","","","","","","","","","","","","","","","","","","","","","","","","","","","","","","","","","","","","","","","","","","",0,{"$f":"IF(AND(ISNUMBER($AU39),$AU39<>0),$AU39*POWER(1+PSBNB,AAA$8)*POWER(1+KALBNB,-AAA$8),\"\")","v":""},"","","","","","","","","","","","","","","","","","","","","","","","","","","","","","","","","","","","","","","","","","","","","","","","","","","","","","","","","","","","","","","","","","","","","","","","","","","","","","",""]
[29,null,null,null,570,"570: Pflanz- und Saatflächen","Ja","Nein",null,0,0,0,null,null,null,0,0,0,49,"",1,null,"","Nein",null,"",0,0,0,null,0,0,"Nein",null,null,0,0,0,0,0,0,0,0,0,0,0,0,0,0,null,null,0,0,0,0,0,0,0,0,0,0,0,0,0,0,0,0,0,0,0,0,0,0,0,0,0,0,0,0,0,0,0,0,0,0,0,0,0,0,0,0,0,0,0,0,0,0,0,0,0,0,"","","","","","","","","","","","","","","","","","","","","","","","","","","","","","","",0,{"$f":"IF(AND(MOD(ED$8,$U40)=0,ED$8<BZBNB),$AN40*POWER(1+PSBNB,(ED$8))*POWER(1+KALBNB,-(ED$8)),\"\")","v":0},0,0,0,0,0,0,0,0,0,0,0,0,0,0,0,0,0,0,0,0,0,0,0,0,0,0,0,0,0,0,0,0,0,0,0,0,0,0,0,0,0,0,0,0,0,0,0,0,"","","","","","","","","","","","","","","","","","","","","","","","","","","","","","","",0,0,0,0,0,0,0,0,0,0,0,0,0,0,0,0,0,0,0,0,0,0,0,0,0,0,0,0,0,0,0,0,0,0,0,0,0,0,0,0,0,0,0,0,0,0,0,0,0,0,"","","","","","","","","","","","","","","","","","","","","","","","","","","","","","","",null,0,"","","","","","","","","","","","","","","","","","","","","","","","","","","","","","","","","","","","","","","","","","","","","","","","","","","","","","","","","","","","","","","",{"$f":"IF(AND(ISNUMBER($AP40),$AP40<>0),$AP40*POWER(1+PSBNB,MV$8)*POWER(1+KALBNB,-MV$8),\"\")","v":""},"","","","","","","","","","","","","","","","",0,"","","","","","","","","","","","","","","","","","","","","","","","","","","","","","","","","","","","","","","","","","","","","","","","","","","","","","","","","","","","","","","","","","","","","","","","","","","","","","","","",0,"","","","","","","","","","","","","","","","","","","","","","","","","","","","","","","","","","","","","","","","","","","","","","","","","","","","","","","","","","","","","","","","","","","","","","","","","","","","","","","","",null,0,"","","","","","","","","","","","","","","","","","","","","","","","","","","","","","","","","","","","","","","","","","","","","","","","","","","","","","","","","","","","","","","","","","","","","","","","","","","","","","","","",0,"","","","","","","","","","","","","","","","","","","","","","","","","","","","","","","","","","","","","","","","","","","","","","","","","","","","","","","","","","","","","","","","","","","","","","","","","","","","","","","","",0,"","","","","","","","","","","","","","","","","","","","","","","","","","","","","","","","","","","","","","","","","","","","","","","","","","","","","","","","","","","","","","","","","","","","","","","","","","","","","","","",""]
[30,null,null,null,590,"590: Sonstige Außenanlagen","Ja","Nein",null,0,0,0,null,null,null,0,0,0,49,"",1,null,"","Nein",null,"",0,0,0,null,0,0,"Nein",null,null,0,0,0,0,0,0,0,0,0,0,0,0,0,0,null,null,0,0,0,0,0,0,0,0,0,0,0,0,0,0,0,0,0,0,0,0,0,0,0,0,0,0,0,0,0,0,0,0,0,0,0,0,0,0,0,0,0,0,0,0,0,0,0,0,0,0,"","","","","","","","","","","","","","","","","","","","","","","","","","","","","","","",0,0,0,0,0,0,0,0,0,0,0,0,0,0,0,0,0,0,0,0,0,0,0,0,0,0,0,0,0,0,0,0,0,0,0,0,0,0,0,0,0,0,0,0,0,0,0,0,0,0,"","","","","","","","","","","","","","","","","","","","","","","","","","","","","","","",0,0,0,0,0,0,0,0,0,0,0,0,0,0,0,0,0,0,0,0,0,0,0,0,0,0,0,0,0,0,0,0,0,0,0,0,0,0,0,0,0,0,0,0,0,0,0,0,0,0,"","","","","","","","","","","","","","","","","","","","","","","","","","","","","","","",null,0,"","","","","","","","","","","","","","","","","","","","","","","","","","","","","","","","",{"$f":"IF(AND(ISNUMBER($AP41),$AP41<>0),$AP41*POWER(1+PSBNB,LQ$8)*POWER(1+KALBNB,-LQ$8),\"\")","v":""},"","","","","","","","","","","","","","","","","","","","","","","","","","","","","","","","","","","","","","","","","","","","","","","",0,"","","","","","","","","","","","","","","","","","","","","","","","","","","","","","","","","","","","","","","","","","","","","","","","","","","","","","","","","","","","","","","","","","","","","","","","","","","","","","","","",0,"","","","","","","","","","","","","","","","","","","","","","","","","","","","","","","","","","","","","","","","","","","","","","","","","","","","","","","","","","","","","","","","","","","","","","","","","","","","","","","","",null,0,"","","","","","","","","","","","","","","","","","","","","","","","","","","","","","","","","","","","","","","","","","","","","","","","","","","","","","","","","","","","","","","","","","","","","","","","","","","","","","","","",0,"","","","","","","","","","","","","","","","","","","","","","","","","","","","","","","","","","","","","","","","","","","","","","","","","","","","","","","","","","","","","","","","","","","","","","","","","","","","","","","","",0,"","","","","","","","","","","","","","","","","","","","","","","","","","","","","","","","","","","","","","","","","","","","","","","","","","","","","","","","","","","","","","","","","","","","","","","","","","","","","","","",""]
[null,null,null,null,null,null,null,null,null,null,null,null,null,null,null,null,null,null,null,{"$f":"IF(ISNUMBER(VLOOKUP(V42,ND_Verweis,2,0)),VLOOKUP(V42,ND_Verweis,2,0),\"\")","v":""},null,null,null,null,null,{"$f":"IF(ISNUMBER(VLOOKUP(AD42,NK_Verweis,4,0)),VLOOKUP(AD42,NK_Verweis,4,0),\"\")","v":""},null,null,null,null,null,null,null,null,null,null,null,null,null,null,null,null,null,null,null,null,null,null,null,null,null,null,null,null,null,null,null,null,null,null,null,null,null,null,null,null,null,null,null,null,null,null,null,null,null,null,null,null,null,null,null,null,null,null,null,null,null,null,null,null,null,null,null,null,null,null,null,null,null,null,null,null,null,null,null,null,null,null,null,null,null,null,null,null,null,null,null,null,null,null,null,null,null,null,null,null,null,null,null,null,null,null,null,null,null,null,null,null,null,null,null,null,null,null,null,null,null,null,null,null,null,null,null,null,null,null,null,null,null,null,null,null,null,null,null,null,null,null,null,null,null,null,null,null,null,null,null,null,null,null,null,null,null,null,null,null,null,null,null,null,null,null,null,null,null,null,null,null,null,null,null,null,null,null,null,null,null,null,null,null,null,null,null,null,null,null,null,null,null,null,null,null,null,null,null,null,null,null,null,null,null,null,null,null,null,null,null,null,null,null,null,null,null,null,null,null,null,null,null,null,null,null,null,null,null,null,null,null,null,null,null,null,null,null,null,null,null,null,null,null,null,null,null,null,null,null,null,null,null,null,null,null,null,null,null,null,null,null,null,null,null,null,null,null,null,{"$f":"SUM(OFFSET(KK42,,,,BZBNB))","v":0}]
[{"$f":"(MAX(A$9:A$42))+1","v":31},null,null,null,{"$f":"IF(ISNUMBER(VLOOKUP(F43,DIN276_Verweis,2,0)),VLOOKUP(F43,DIN276_Verweis,2,0),\"k.A.\")","v":"k.A."},null,"Ja","Nein",null,{"$f":"O43*M43","v":0},{"$f":"IF(G43=\"Ja\",$J43*PINDbnb,0)","v":0},{"$f":"IF(AND(G43=\"Ja\",H43=\"Nein\"),$J43*PINDbnb,0)","v":0},null,null,null,{"$f":"IF(G43=\"Nein\",$J43,0)","v":0},{"$f":"P43*M43","v":0},{"$f":"IF(G43=\"Nein\",$Q43*PINDbnb,0)","v":0},{"$f":"(BZBNB-MOD(BZBNB-1,U43)-1)/U43","v":49},"",{"$f":"IF(AND(IF(X43=\"Nein\",W43,Y43)>0,ISNUMBER(IF(X43=\"Nein\",W43,Y43))),IF(X43=\"Nein\",W43,Y43),1)","v":1},null,{"$f":"IF(ISNUMBER(VLOOKUP(V43,ND_Verweis,5,0)),VLOOKUP(V43,ND_Verweis,5,0),\"\")","v":""},"Nein",null,{"$f":"IF(ISNUMBER(VLOOKUP(AD43,NK_Verweis,4,0)),VLOOKUP(AD43,NK_Verweis,4,0),\"\")","v":""},{"$f":"SUM(AP43:AR43)","v":0},{"$f":"SUM(AS43:AU43)","v":0},{"$f":"SUM(AA43:AB43)","v":0},null,{"$f":"IF(ISNUMBER(VLOOKUP(AD43,NK_Verweis,7,0)),VLOOKUP(AD43,NK_Verweis,7,0),0)","v":0},{"$f":"IF(ISNUMBER(VLOOKUP(AD43,NK_Verweis,8,0)),VLOOKUP(AD43,NK_Verweis,8,0),0)","v":0},"Nein",null,null,{"$f":"IF(AND($E43>=300,$E43<400,$G43=\"Ja\",$H43=\"Nein\"),$K43,0)","v":0},{"$f":"IF(AND($E43>=400,$E43<500,$G43=\"Ja\",$H43=\"Nein\"),$K43,0)","v":0},{"$f":"IF(AND($E43>=500,$E43<600,$G43=\"Ja\",$H43=\"Nein\"),$K43,0)","v":0},0,0,0,{"$f":"IF(AND($E43>=300,$E43<400,$G43=\"Ja\"),IF($AG43=\"Ja\",$AH43,$AM43*$AE43),0)","v":0},{"$f":"IF(AND($E43>=400,$E43<500,$G43=\"Ja\"),IF($AG43=\"Ja\",$AH43,$AN43*$AE43),0)","v":0},{"$f":"IF(AND($E43>=500,$E43<600,$G43=\"Ja\"),IF($AG43=\"Ja\",$AH43,$AO43*$AE43),0)","v":0},{"$f":"IF(AND($E43>=300,$E43<400,$G43=\"Ja\"),IF($AG43=\"Ja\",$AI43,$AM43*$AF43),0)","v":0},{"$f":"IF(AND($E43>=400,$E43<500,$G43=\"Ja\"),IF($AG43=\"Ja\",$AI43,$AN43*$AF43),0)","v":0},{"$f":"IF(AND($E43>=500,$E43<600,$G43=\"Ja\"),IF($AG43=\"Ja\",$AI43,$AO43*$AF43),0)","v":0},{"$f":"IF(AND(ISNUMBER(BGFabc),BGFabc>0),AW43/BGFabc,\"\")","v":0},{"$f":"AZ43+EC43+HF43+KJ43+NM43+QP43+TT43+WW43+ZZ43","v":0},null,null,{"$f":"SUM(OFFSET(BA43,,,,BZBNB-1))","v":0},0,0,0,0,0,0,0,0,0,0,0,0,0,0,0,0,0,0,0,0,0,0,0,0,0,0,0,0,0,0,0,0,0,0,0,0,0,0,0,0,0,0,0,0,0,0,0,0,0,"","","","","","","","","","","","","","","","","","","","","","","","","","","","","","","",{"$f":"SUM(OFFSET(ED43,,,,BZBNB-1))","v":0},0,0,0,0,0,0,0,0,0,0,0,0,0,0,0,0,0,0,0,0,0,0,0,0,0,0,0,0,0,0,0,0,0,0,0,0,0,0,0,0,0,0,0,0,0,0,0,0,0,"","","","","","","","","","","","","","","","","","","","","","","","","","","","","","","",{"$f":"SUM(OFFSET(HG43,,,,BZBNB-1))","v":0},0,0,0,0,0,0,0,0,0,0,0,0,0,0,0,0,0,0,0,0,0,0,0,0,0,0,0,0,0,0,0,0,0,0,0,0,0,0,0,0,0,0,0,0,0,0,0,0,0,"","","","","","","","","","","","","","","","","","","","","","","","","","","","","","","",null,0,{"$f":"IF(AND(ISNUMBER($AP43),$AP43<>0),$AP43*POWER(1+PSBNB,KK$8)*POWER(1+KALBNB,-KK$8),\"\")","v":""},"","","","","","","","","","","","","","","","","","","","","","","","","","","","","","","","","","","","","","","","","","","","","","","","","","","","","","","","","","","","","","","","","","","","","","","","","","","","","","","",{"$f":"SUM(OFFSET(NN43,,,,BZBNB))","v":0},"","","","","","","","","","","","","","","","","","","","","","","","","","","","","","","","","","","","","","","","","","","","","","","","","","","","","","","","","","","","","","","","","","","","","","","","","","","","","","","","",{"$f":"SUM(OFFSET(QQ43,,,,BZBNB))","v":0},"","","","","","","","","","","","","","","","","","","","","","","","","","","","","","","","","","","","","","","","","","","","","","","","","","","","","","","","","","","","","","","","","","","","","","","","","","","","","","","","",null,{"$f":"SUM(OFFSET(TU43,,,,BZBNB))","v":0},"","","","","","","","","","","","","","","","","","","","","","","","","","","","","","","","","","","","","","","","","","","","","","","","","","","","","","","","","","","","","","","","","","","","","","","","","","","","","","","","",{"$f":"SUM(OFFSET(WX43,,,,BZBNB))","v":0},"","","","","","","","","","","","","","","","","","","","","","","","","","","","","","","","","","","","","","","","","","","","","","","","","","","","","","","","","","","","","","","","","","","","","","","","","","","","","","","","",{"$f":"SUM(OFFSET(AAA43,,,,BZBNB))","v":0},"","","","","","","","","","","","","","","","","","","","","","","","","","","","","","","","","","","","","","","","","","","","","","","","","","","","","","","","","","","","","","","","","","","","","","","","","","","","","","","",""]

{"sheet":"Bauteilreinigung","index":4,"n_rows":31,"n_cols":99,"rows_kept":31,"cut":false,"hidden":false,"merged":[[0,0,0,1],[1,1,1,2],[2,1,2,2]]}
["Berechnung LCC nach BNB BN 2.1.1 v2015\nEingabe Bauteilreinigung",null,"BBR-LCC\nVer. 15-1\nBBR A1"]
["Projekt:",{"$f":"IF(ISTEXT(Projekt),Projekt,\"\")","v":"Beispieleingabe\n\n(Szenario: 10 Mio Euro netto Herstellungskosten für KG 300 und 400)\n"}]
["Stand:",{"$f":"IF(ISNUMBER(LCC_Stand),LCC_Stand,\"\")","v":"2018-01-08"}]
[]
["Nr.","Bezeichnung","Einbauort","Reinigungs-fläche","Seiten","Bauteil","Oberfläche","Typ","Einbauort","Material","Zugänglichkeit","Belastung","€/h","m²/h","Anzahl je Jahr","€/m²","€/m²*a","€/a","Barwert","Barwert","Barwert","Barwert","Barwert","Barwert","Barwert","Barwert","Barwert","Barwert","Barwert","Barwert","Barwert","Barwert","Barwert","Barwert","Barwert","Barwert","Barwert","Barwert","Barwert","Barwert","Barwert","Barwert","Barwert","Barwert","Barwert","Barwert","Barwert","Barwert","Barwert","Barwert","Barwert","Barwert","Barwert","Barwert","Barwert","Barwert","Barwert","Barwert","Barwert","Barwert","Barwert","Barwert","Barwert","Barwert","Barwert","Barwert","Barwert","Barwert","Barwert","Barwert","Barwert","Barwert","Barwert","Barwert","Barwert","Barwert","Barwert","Barwert","Barwert","Barwert","Barwert","Barwert","Barwert","Barwert","Barwert","Barwert","Barwert","Barwert","Barwert","Barwert","Barwert","Barwert","Barwert","Barwert","Barwert","Barwert","Barwert","Barwert","Barwert"]
[null,null,null,null,null,null,null,null,null,null,null,null,null,null,null,null,null,null,"∑ BZR",1,2,3,4,5,6,7,8,9,10,11,12,13,14,15,16,17,18,19,20,21,22,23,24,25,26,27,28,29,30,31,32,33,34,35,36,37,38,39,40,41,42,43,44,45,46,47,48,49,50,51,52,53,54,55,56,57,58,59,60,61,62,63,64,65,66,67,68,69,70,71,72,73,74,75,76,77,78,79,80]
[null,null,null,null,null,null,null,null,null,null,null,null,null,null,null,null,null,{"$f":"SUM(R8:R31)","v":22783.333333333332},1294490.8825476358,22895.566502463058,23008.352544347119,23121.694182496609,23235.59415383896,23350.055208783982,23465.080111290314,23580.671638932141,23696.83258296629,23813.565748399626,23930.873954056769,24048.760032648181,24167.226830838576,24286.277209315616,24405.914042859047,24526.140220410074,24646.958645141163,24768.372234526105,24890.383920410466,25012.996649082437,25136.21338134394,25260.03709258209,25384.470772841119,25509.517426894519,25635.18007431765,25761.461749560596,25888.365502021497,26015.894396120118,26144.051511371959,26272.839942462455,26402.262799321888,{"$f":"SUM(AX8:AX31)","v":26532.323207200316},26663.02430674318,26794.369254067045,26926.36122083585,27059.003394337509,27192.298977560844,27326.251189272978,27460.863264096992,27596.138452590076,27732.080021322054,27868.691252954181,28005.975446318495,28143.935916497401,28282.575994903807,28421.899029361459,28561.908384185906,28702.607440265634,28843.9995951438,28986.088263100188,29128.876875233676,0,0,0,0,0,0,0,0,0,0,0,0,{"$f":"SUM(CD8:CD31)","v":0},0,0,0,0,0,0,0,0,0,0,0,0,0,0,0,0,0]
[]
[1,null,null,2000,2,"00001; Fenster, Tür, Festverglasung; außen; gut zugänglich",{"$f":"IF(ISTEXT(VLOOKUP($F9,KatalogReinigung,3,0)),VLOOKUP($F9,KatalogReinigung,3,0),\"\")","v":"Fenster, Tür, Festverglasung"},{"$f":"IF(ISTEXT(VLOOKUP($F9,KatalogReinigung,4,0)),VLOOKUP($F9,KatalogReinigung,4,0),\"\")","v":""},{"$f":"IF(ISTEXT(VLOOKUP($F9,KatalogReinigung,5,0)),VLOOKUP($F9,KatalogReinigung,5,0),\"\")","v":"außen"},{"$f":"IF(ISTEXT(VLOOKUP($F9,KatalogReinigung,6,0)),VLOOKUP($F9,KatalogReinigung,6,0),\"\")","v":"Glas"},{"$f":"IF(ISTEXT(VLOOKUP($F9,KatalogReinigung,7,0)),VLOOKUP($F9,KatalogReinigung,7,0),\"\")","v":"gut zugänglich"},{"$f":"IF(ISTEXT(VLOOKUP($F9,KatalogReinigung,8,0)),VLOOKUP($F9,KatalogReinigung,8,0),\"\")","v":""},{"$f":"IF(ISNUMBER(VLOOKUP($F9,KatalogReinigung,8,0)),VLOOKUP($F9,KatalogReinigung,8,0),\"\")","v":22.5},{"$f":"IF(ISNUMBER(VLOOKUP($F9,KatalogReinigung,9,0)),VLOOKUP($F9,KatalogReinigung,9,0),\"\")","v":25},{"$f":"IF(ISNUMBER(VLOOKUP($F9,KatalogReinigung,10,0)),VLOOKUP($F9,KatalogReinigung,10,0),\"\")","v":2},{"$f":"IF(ISNUMBER(M9/N9),M9/N9,\"\")","v":0.9},{"$f":"(IF(ISNUMBER(P9*O9),P9*O9,\"\"))","v":1.8},{"$f":"IF(ISNUMBER(Q9*E9*D9),Q9*E9*D9,\"\")","v":7200},{"$f":"SUM(OFFSET(T9,,,,BZBNB))","v":409085.63369464432},{"$f":"IF(AND(ISNUMBER($R9),ISNUMBER($R9*POWER(1+PSBNB,T$6)*POWER(1+KALBNB,-T$6)),T$6<BZBNB+1),$R9*POWER(1+PSBNB,T$6)*POWER(1+KALBNB,-T$6),\"\")","v":7235.467980295567},{"$f":"IF(AND(ISNUMBER($R9),ISNUMBER($R9*POWER(1+PSBNB,U$6)*POWER(1+KALBNB,-U$6)),U$6<BZBNB+1),$R9*POWER(1+PSBNB,U$6)*POWER(1+KALBNB,-U$6),\"\")","v":7271.1106797058919},7306.9289589162654,7342.9236828518151,7379.0957206983767,7415.445945923494,7451.9752362975014,7488.6844739147327,7525.5745452148049,7562.6463410040415,7599.9007564769663,7637.3386912379401,7674.9610493228565,7712.7687392210019,7750.7626738969657,7788.9437708127161,7827.312951949727,7865.8711438312512,7904.6192775447071,7943.5582887641413,7982.689117772833,8022.0127094860018,8061.5300134736162,8101.2419839833401,8141.1495799635541,8181.2537650865297,8221.5555077716836,8262.0557812089883,8302.7555633824286,8343.6558370936764,8384.757589985762,8426.061814566976,{"$f":"IF(AND(ISNUMBER($R9),ISNUMBER($R9*POWER(1+PSBNB,AZ$6)*POWER(1+KALBNB,-AZ$6)),AZ$6<BZBNB+1),$R9*POWER(1+PSBNB,AZ$6)*POWER(1+KALBNB,-AZ$6),\"\")","v":8467.5695082347956},8509.2816732999909,8551.199317010829,8593.3234515773856,8635.6550941959958,8678.1952670738119,8720.9449974534837,8763.9053176379857,8807.0772650155141,8850.4618820845571,8894.0602164790616,8937.8733209937418,8981.9022536094726,9026.1480775188829,9070.6118611519778,9115.2946782019899,9160.1976076512656,9205.321733797331,"","","","","","","","","","","","","","",{"$f":"IF(AND(ISNUMBER($R9),ISNUMBER($R9*POWER(1+PSBNB,CF$6)*POWER(1+KALBNB,-CF$6)),CF$6<BZBNB+1),$R9*POWER(1+PSBNB,CF$6)*POWER(1+KALBNB,-CF$6),\"\")","v":""},"","","","","","","","","","","","","","",""]
[2,null,null,null,null,"00002; Fenster, Tür, Festverglasung; ; außen; mittel zugänglich",{"$f":"IF(ISTEXT(VLOOKUP($F10,KatalogReinigung,3,0)),VLOOKUP($F10,KatalogReinigung,3,0),\"\")","v":"Fenster, Tür, Festverglasung"},{"$f":"IF(ISTEXT(VLOOKUP($F10,KatalogReinigung,4,0)),VLOOKUP($F10,KatalogReinigung,4,0),\"\")","v":""},{"$f":"IF(ISTEXT(VLOOKUP($F10,KatalogReinigung,5,0)),VLOOKUP($F10,KatalogReinigung,5,0),\"\")","v":"außen"},{"$f":"IF(ISTEXT(VLOOKUP($F10,KatalogReinigung,6,0)),VLOOKUP($F10,KatalogReinigung,6,0),\"\")","v":"Glas"},{"$f":"IF(ISTEXT(VLOOKUP($F10,KatalogReinigung,7,0)),VLOOKUP($F10,KatalogReinigung,7,0),\"\")","v":"mittel zugänglich"},{"$f":"IF(ISTEXT(VLOOKUP($F10,KatalogReinigung,8,0)),VLOOKUP($F10,KatalogReinigung,8,0),\"\")","v":""},{"$f":"IF(ISNUMBER(VLOOKUP($F10,KatalogReinigung,8,0)),VLOOKUP($F10,KatalogReinigung,8,0),\"\")","v":22.5},{"$f":"IF(ISNUMBER(VLOOKUP($F10,KatalogReinigung,9,0)),VLOOKUP($F10,KatalogReinigung,9,0),\"\")","v":20},{"$f":"IF(ISNUMBER(VLOOKUP($F10,KatalogReinigung,10,0)),VLOOKUP($F10,KatalogReinigung,10,0),\"\")","v":2},1.125,{"$f":"(IF(ISNUMBER(P10*O10),P10*O10,\"\"))","v":2.25},0,{"$f":"SUM(OFFSET(T10,,,,BZBNB))","v":0},{"$f":"IF(AND(ISNUMBER($R10),ISNUMBER($R10*POWER(1+PSBNB,T$6)*POWER(1+KALBNB,-T$6)),T$6<BZBNB+1),$R10*POWER(1+PSBNB,T$6)*POWER(1+KALBNB,-T$6),\"\")","v":0},0,0,0,0,0,0,0,0,0,0,0,0,0,0,0,0,0,0,0,0,0,0,0,0,0,0,0,0,0,0,0,{"$f":"IF(AND(ISNUMBER($R10),ISNUMBER($R10*POWER(1+PSBNB,AZ$6)*POWER(1+KALBNB,-AZ$6)),AZ$6<BZBNB+1),$R10*POWER(1+PSBNB,AZ$6)*POWER(1+KALBNB,-AZ$6),\"\")","v":0},0,0,0,0,0,0,0,0,0,0,0,0,0,0,0,0,0,"","","","","","","","","","","","","","",{"$f":"IF(AND(ISNUMBER($R10),ISNUMBER($R10*POWER(1+PSBNB,CF$6)*POWER(1+KALBNB,-CF$6)),CF$6<BZBNB+1),$R10*POWER(1+PSBNB,CF$6)*POWER(1+KALBNB,-CF$6),\"\")","v":""},"","","","","","","","","","","","","","",""]
[3,null,null,null,null,"00003; Fenster, Tür, Festverglasung; ; außen; schwer zugänglich","Fenster, Tür, Festverglasung","","außen","Glas","schwer zugänglich","",22.5,13,2,1.7307692307692308,3.4615384615384617,0,0,0,0,0,0,0,0,0,0,0,0,0,0,0,0,0,0,0,0,0,0,0,0,0,0,0,0,0,0,0,0,0,0,0,0,0,0,0,0,0,0,0,0,0,0,0,0,0,0,0,0,"","","","","","","","","","","","","","","","","","","","","","","","","","","","","",""]
[4,null,null,null,null,"00004; Glasfläche; Geländer; außen; gut zugänglich","Glasfläche","Geländer","außen","Glas","gut zugänglich","",22.5,25,2,0.9,1.8,0,0,0,0,0,0,0,0,0,0,0,0,0,0,0,0,0,0,0,0,0,0,0,0,0,0,0,0,0,0,0,0,0,0,0,0,0,0,0,0,0,0,0,0,0,0,0,0,0,0,0,0,"","","","","","","","","","","","","","","","","","","","","","","","","","","","","",""]
[5,null,null,null,null,"00005; Glasfläche; Geländer; außen; mittel zugänglich","Glasfläche","Geländer","außen","Glas","mittel zugänglich","",22.5,20,2,1.125,2.25,0,0,0,0,0,0,0,0,0,0,0,0,0,0,0,0,0,0,0,0,0,0,0,0,0,0,0,0,0,0,0,0,0,0,0,0,0,0,0,0,0,0,0,0,0,0,0,0,0,0,0,0,"","","","","","","","","","","","","","","","","","","","","","","","","","","","","",""]
[6,null,null,null,null,"00006; Glasfläche; Geländer; außen; schwer zugänglich","Glasfläche","Geländer","außen","Glas","schwer zugänglich","",22.5,13,2,1.7307692307692308,3.4615384615384617,0,0,0,0,0,0,0,0,0,0,0,0,0,0,0,0,0,0,0,0,0,0,0,0,0,0,0,0,0,0,0,0,0,0,0,0,0,0,0,0,0,0,0,0,0,0,0,0,0,0,0,0,"","","","","","","","","","","","","","","","","","","","","","","","","","","","","",""]
[7,null,null,null,null,"00007; Glasfläche; sonstige Verglasung; außen; gut zugänglich","Glasfläche","sonstige Verglasung","außen","Glas","gut zugänglich","",22.5,25,2,0.9,1.8,0,0,0,0,0,0,0,0,0,0,0,0,0,0,0,0,0,0,0,0,0,0,0,0,0,0,0,0,0,0,0,0,0,0,0,0,0,0,0,0,0,0,0,0,0,0,0,0,0,0,0,0,"","","","","","","","","","","","","","","","","","","","","","","","","","","","","",""]
[8,null,null,null,null,"00008; Glasfläche; sonstige Verglasung; außen; mittel zugänglich","Glasfläche","sonstige Verglasung","außen","Glas","mittel zugänglich","",22.5,20,2,1.125,2.25,0,0,0,0,0,0,0,0,0,0,0,0,0,0,0,0,0,0,0,0,0,0,0,0,0,0,0,0,0,0,0,0,0,{"$f":"IF(AND(ISNUMBER($R16),ISNUMBER($R16*POWER(1+PSBNB,AY$6)*POWER(1+KALBNB,-AY$6)),AY$6<BZBNB+1),$R16*POWER(1+PSBNB,AY$6)*POWER(1+KALBNB,-AY$6),\"\")","v":0},0,0,0,0,0,0,0,0,0,0,0,0,0,0,0,0,0,0,"","","","","","","","","","","","","",{"$f":"IF(AND(ISNUMBER($R16),ISNUMBER($R16*POWER(1+PSBNB,CE$6)*POWER(1+KALBNB,-CE$6)),CE$6<BZBNB+1),$R16*POWER(1+PSBNB,CE$6)*POWER(1+KALBNB,-CE$6),\"\")","v":""},"","","","","","","","","","","","","","","",""]
[9,null,null,null,null,"00009; Glasfläche; sonstige Verglasung; außen; schwer zugänglich","Glasfläche","sonstige Verglasung","außen","Glas","schwer zugänglich","",22.5,13,2,1.7307692307692308,3.4615384615384617,0,0,{"$f":"IF(AND(ISNUMBER($R17),ISNUMBER($R17*POWER(1+PSBNB,T$6)*POWER(1+KALBNB,-T$6)),T$6<BZBNB+1),$R17*POWER(1+PSBNB,T$6)*POWER(1+KALBNB,-T$6),\"\")","v":0},0,0,0,0,0,0,0,0,0,0,0,0,0,0,0,0,0,0,0,0,0,0,0,0,0,0,0,0,0,0,0,0,0,0,0,0,0,0,0,0,0,0,0,0,0,0,0,0,0,"","","","","","","","","","","","","","","","","","","","","","","","","","","","","",""]
[10,null,null,null,null,"00010; AW-Bekleidung; Naturstein weich; außen; ","AW-Bekleidung","Naturstein weich","außen","Naturstein weich","","",17,1.5,0.25,11.333333333333334,2.8333333333333335,0,0,0,0,0,0,0,0,0,0,0,0,0,0,0,0,0,0,0,0,0,0,0,0,0,0,0,0,0,0,0,0,0,0,0,0,0,0,0,0,0,0,0,0,0,0,0,0,0,0,0,0,"","","","","","","","","","","","","","","","","","","","","","","","","","","","","",""]
[11,null,null,null,null,"00011; AW-Bekleidung; Naturstein hart; außen; ","AW-Bekleidung","Naturstein hart","außen","Naturstein hart","","",17,6,0.25,2.8333333333333335,0.70833333333333337,0,0,0,0,0,0,0,0,0,0,0,0,0,0,0,0,0,0,0,0,0,0,0,0,0,0,0,0,0,0,0,0,0,0,0,0,0,0,0,0,0,0,0,0,0,0,0,0,0,0,0,0,"","","","","","","","","","","","","","","","","","","","","","","","","","","","","",""]
[12,null,null,null,null,"00012; AW-Bekleidung; Aluminium; außen; ","AW-Bekleidung","Aluminium","außen","Aluminium","","",17,3,0.25,5.666666666666667,1.4166666666666667,0,0,0,0,0,0,0,0,0,0,0,0,0,0,0,0,0,0,0,0,0,0,0,0,0,0,0,0,0,0,0,0,0,0,0,0,0,0,0,0,0,0,0,0,0,0,0,0,0,0,0,0,"","","","","","","","","","","","","",{"$f":"IF(AND(ISNUMBER($R20),ISNUMBER($R20*POWER(1+PSBNB,CE$6)*POWER(1+KALBNB,-CE$6)),CE$6<BZBNB+1),$R20*POWER(1+PSBNB,CE$6)*POWER(1+KALBNB,-CE$6),\"\")","v":""},"","","","","","","","","","","","","","","",""]
[13,null,null,null,null,"00013; AW-Bekleidung; Edelstahl; außen; ","AW-Bekleidung","Edelstahl","außen","Edelstahl","","",17,3,0.25,5.666666666666667,1.4166666666666667,0,0,{"$f":"IF(AND(ISNUMBER($R21),ISNUMBER($R21*POWER(1+PSBNB,T$6)*POWER(1+KALBNB,-T$6)),T$6<BZBNB+1),$R21*POWER(1+PSBNB,T$6)*POWER(1+KALBNB,-T$6),\"\")","v":0},0,0,0,0,0,0,0,0,0,0,0,0,0,0,0,0,0,0,0,0,0,0,0,0,0,0,0,0,0,0,0,0,0,0,0,0,0,0,0,0,0,0,0,0,0,0,0,0,0,"","","","","","","","","","","","","","","","","","","","","","","","","","","","","",""]
[14,null,null,null,null,"00014; AW-Bekleidung; Kupferblech; außen; ","AW-Bekleidung","Kupferblech","außen","Kupferblech","","",17,3,0.25,5.666666666666667,1.4166666666666667,0,0,0,0,0,0,0,0,0,0,0,0,0,0,0,0,0,0,0,0,0,0,0,0,0,0,0,0,0,0,0,0,0,0,0,0,0,0,0,0,0,0,0,0,0,0,0,0,0,0,0,0,"","","","","","","","","","","","","","","","","","","","","","","","","","","","","",""]
[15,null,null,null,null,"00015; AW-Bekleidung; Stahl korrosionsgeschützt; außen; ","AW-Bekleidung","Stahl korrosionsgeschützt","außen","Stahl korrosionsgeschützt","","",17,3,0.25,5.666666666666667,1.4166666666666667,0,0,0,0,0,0,0,0,0,0,0,0,0,0,0,0,0,0,0,0,0,0,0,0,0,0,0,0,0,0,0,0,0,0,0,0,0,0,0,0,0,0,0,0,0,0,0,0,0,0,0,0,"","","","","","","","","","","","","","","","","","","","","","","","","","","","","",""]
[16,null,null,null,null,"00016; AW-Bekleidung; Glas; außen; ","AW-Bekleidung","Glas","außen","Glas","","",17,20,0.25,0.85,0.21249999999999999,0,0,0,0,0,0,0,0,0,0,0,0,0,0,0,0,0,0,0,0,0,0,0,0,0,0,0,0,0,0,0,0,0,0,0,0,0,0,0,0,0,0,0,0,0,0,0,0,0,0,0,0,"","","","","","","","","","","","","",{"$f":"IF(AND(ISNUMBER($R24),ISNUMBER($R24*POWER(1+PSBNB,CE$6)*POWER(1+KALBNB,-CE$6)),CE$6<BZBNB+1),$R24*POWER(1+PSBNB,CE$6)*POWER(1+KALBNB,-CE$6),\"\")","v":""},"","","","","","","","","","","","","","","",{"$f":"IF(AND(ISNUMBER($R24),ISNUMBER($R24*POWER(1+PSBNB,CU$6)*POWER(1+KALBNB,-CU$6)),CU$6<BZBNB+1),$R24*POWER(1+PSBNB,CU$6)*POWER(1+KALBNB,-CU$6),\"\")","v":""}]
[17,null,null,null,null,"00017; AW-Bekleidung; Keramik; außen; ","AW-Bekleidung","Keramik","außen","Keramik","","",17,6,0.25,2.8333333333333335,0.70833333333333337,0,0,{"$f":"IF(AND(ISNUMBER($R25),ISNUMBER($R25*POWER(1+PSBNB,T$6)*POWER(1+KALBNB,-T$6)),T$6<BZBNB+1),$R25*POWER(1+PSBNB,T$6)*POWER(1+KALBNB,-T$6),\"\")","v":0},0,0,0,0,0,0,0,0,0,0,0,0,0,0,0,0,0,0,0,0,0,0,0,0,0,0,0,0,0,0,0,0,0,0,0,0,0,0,0,0,0,0,0,0,0,0,0,0,0,"","","","","","","","","","","","","","",{"$f":"IF(AND(ISNUMBER($R25),ISNUMBER($R25*POWER(1+PSBNB,CF$6)*POWER(1+KALBNB,-CF$6)),CF$6<BZBNB+1),$R25*POWER(1+PSBNB,CF$6)*POWER(1+KALBNB,-CF$6),\"\")","v":""},"","","","","","","","","","","","","","",""]
[18,null,null,null,null,"00018; AW-Bekleidung; Kunst/ Werkstein; außen; ","AW-Bekleidung","Kunst/ Werkstein","außen","Kunst/ Werkstein","","",17,6,0.25,2.8333333333333335,0.70833333333333337,0,0,0,0,0,0,0,0,0,0,0,0,0,0,0,0,0,0,0,0,0,0,0,0,0,0,0,0,0,0,0,0,0,0,0,0,0,0,0,0,0,0,0,0,0,0,0,0,0,0,0,0,"","","","","","","","","","","","","","","","","","","","","","","","","","","","","",""]
[19,null,null,null,null,"00019; Türen allgemein + Innenfenster; außer Glastür außen; ","Türen allgemein + Innenfenster","außer Glastür außen","","","","",17,250,4,6.8000000000000005E-2,0.27200000000000002,0,0,0,0,0,0,0,0,0,0,0,0,0,0,0,0,0,0,0,0,0,0,0,0,0,0,0,0,0,0,0,0,0,0,0,0,0,0,0,0,0,0,0,0,0,0,0,0,0,0,0,0,"","","","","","","","","","","","","","","","","","","","","","","","","","","","","",""]
[20,null,null,500,1,"00020; Sanitäreinrichtung; Ansatz über m² Bodenfläche; innen; ","Sanitäreinrichtung","Ansatz über m² Bodenfläche","innen","","","",17,150,250,0.11333333333333333,28.333333333333332,14166.666666666666,804913.86259362882,14236.453201970446,14306.583513310205,14377.059294163948,14447.882246351952,14519.054080077824,14590.576513969836,14662.451275122397,14734.68009913778,14807.264730168019,14880.206920957025,14953.508432882922,15027.171036000576,15101.196509084326,15175.586639670952,15250.343224102824,15325.468067571315,15400.962984160344,15476.829796890195,15553.070337761574,15629.686447799815,15706.679977099322,15784.052784868289,15861.80673947355,15939.943718485738,16018.465608724584,16097.374306304515,16176.671716680396,16256.359754693609,16336.440344618204,16416.915420207464,16497.786924740503,16579.056811069277,16660.727041665683,16742.79958866896,16825.276433933344,16908.159569075873,16991.450995524527,17075.152724566527,17159.266777396901,17243.795185167335,17328.739989035152,17414.103240212669,17499.887000016672,17586.093339918243,17672.724341592711,17759.782096970022,17847.268708285141,17935.186288128916,18023.536959499019,18112.322855851224,"","","","","","","","","","","","","",{"$f":"IF(AND(ISNUMBER($R28),ISNUMBER($R28*POWER(1+PSBNB,CE$6)*POWER(1+KALBNB,-CE$6)),CE$6<BZBNB+1),$R28*POWER(1+PSBNB,CE$6)*POWER(1+KALBNB,-CE$6),\"\")","v":""},"","","","","","","","","","","","","","","",""]
[21,null,null,1000,1,"00021; Sonnenschutzfläche; Jalousie; außen; normal","Sonnenschutzfläche","Jalousie","außen","Aluminium","normal","",17,3,0.25,5.666666666666667,1.4166666666666667,1416.6666666666667,80491.386259362858,{"$f":"IF(AND(ISNUMBER($R29),ISNUMBER($R29*POWER(1+PSBNB,T$6)*POWER(1+KALBNB,-T$6)),T$6<BZBNB+1),$R29*POWER(1+PSBNB,T$6)*POWER(1+KALBNB,-T$6),\"\")","v":1423.6453201970446},1430.6583513310204,1437.7059294163948,1444.7882246351953,1451.9054080077824,1459.0576513969838,1466.2451275122398,1473.4680099137781,1480.7264730168019,1488.0206920957028,1495.3508432882923,1502.7171036000577,1510.1196509084325,1517.5586639670953,1525.0343224102826,1532.5468067571317,1540.0962984160344,1547.6829796890195,1555.3070337761576,1562.9686447799818,1570.6679977099325,1578.405278486829,1586.1806739473552,1593.994371848574,1601.8465608724587,1609.7374306304514,1617.6671716680398,1625.6359754693613,1633.6440344618204,1641.6915420207465,1649.7786924740506,1657.9056811069279,1666.0727041665687,1674.2799588668965,1682.5276433933345,1690.8159569075876,1699.1450995524528,1707.5152724566528,1715.9266777396901,1724.3795185167335,1732.8739989035157,1741.4103240212669,1749.9887000016672,1758.6093339918241,1767.2724341592714,1775.9782096970025,1784.7268708285142,1793.5186288128918,1802.3536959499017,1811.2322855851228,"","","","","","","","","","","","","","","","","","","","","","","","","","","","","",""]
[]
[{"$f":"(MAX(A$8:A$30))+1","v":22},null,null,null,null,null,{"$f":"IF(ISTEXT(VLOOKUP($F31,KatalogReinigung,3,0)),VLOOKUP($F31,KatalogReinigung,3,0),\"\")","v":""},{"$f":"IF(ISTEXT(VLOOKUP($F31,KatalogReinigung,4,0)),VLOOKUP($F31,KatalogReinigung,4,0),\"\")","v":""},{"$f":"IF(ISTEXT(VLOOKUP($F31,KatalogReinigung,5,0)),VLOOKUP($F31,KatalogReinigung,5,0),\"\")","v":""},{"$f":"IF(ISTEXT(VLOOKUP($F31,KatalogReinigung,6,0)),VLOOKUP($F31,KatalogReinigung,6,0),\"\")","v":""},{"$f":"IF(ISTEXT(VLOOKUP($F31,KatalogReinigung,7,0)),VLOOKUP($F31,KatalogReinigung,7,0),\"\")","v":""},{"$f":"IF(ISTEXT(VLOOKUP($F31,KatalogReinigung,8,0)),VLOOKUP($F31,KatalogReinigung,8,0),\"\")","v":""},{"$f":"IF(ISNUMBER(VLOOKUP($F31,KatalogReinigung,8,0)),VLOOKUP($F31,KatalogReinigung,8,0),\"\")","v":""},{"$f":"IF(ISNUMBER(VLOOKUP($F31,KatalogReinigung,9,0)),VLOOKUP($F31,KatalogReinigung,9,0),\"\")","v":""},{"$f":"IF(ISNUMBER(VLOOKUP($F31,KatalogReinigung,10,0)),VLOOKUP($F31,KatalogReinigung,10,0),\"\")","v":""},{"$f":"IF(ISNUMBER(M31/N31),M31/N31,\"\")","v":""},{"$f":"(IF(ISNUMBER(P31*O31),P31*O31,\"\"))","v":""},{"$f":"IF(ISNUMBER(Q31*E31*D31),Q31*E31*D31,\"\")","v":""},{"$f":"SUM(OFFSET(T31,,,,BZBNB))","v":0},"","","","","","","","","","","","","","","","","","","","","","","","","","","","","","","","","","","","","","","","","","","","","","","","","","","","","","","","","","","","","","","","","","","","","","","","","","","","","","","",""]

{"sheet":"Bodenreinigung","index":5,"n_rows":25,"n_cols":95,"rows_kept":25,"cut":false,"hidden":false,"merged":[[0,0,0,1],[1,1,1,2],[2,1,2,2]]}
["Berechnung LCC nach BNB BN 2.1.1 v2015\nEingabe Bodenreinigung",null,"BBR-LCC\nVer. 15-1\nBBR A1"]
["Projekt:",{"$f":"IF(ISTEXT(Projekt),Projekt,\"\")","v":"Beispieleingabe\n\n(Szenario: 10 Mio Euro netto Herstellungskosten für KG 300 und 400)\n"}]
["Stand:",{"$f":"IF(ISNUMBER(LCC_Stand),LCC_Stand,\"\")","v":"2018-01-08"}]
[]
["Nr.","Raumbezeichnung","Raumnr.","Fläche","Oberflächentyp","Typ","Material","Belastung","€/h","m²/h","Anzahl je Jahr","€/m²","€/m²*a","€/a","Barwert","Barwert","Barwert","Barwert","Barwert","Barwert","Barwert","Barwert","Barwert","Barwert","Barwert","Barwert","Barwert","Barwert","Barwert","Barwert","Barwert","Barwert","Barwert","Barwert","Barwert","Barwert","Barwert","Barwert","Barwert","Barwert","Barwert","Barwert","Barwert","Barwert","Barwert","Barwert","Barwert","Barwert","Barwert","Barwert","Barwert","Barwert","Barwert","Barwert","Barwert","Barwert","Barwert","Barwert","Barwert","Barwert","Barwert","Barwert","Barwert","Barwert","Barwert","Barwert","Barwert","Barwert","Barwert","Barwert","Barwert","Barwert","Barwert","Barwert","Barwert","Barwert","Barwert","Barwert","Barwert","Barwert","Barwert","Barwert","Barwert","Barwert","Barwert","Barwert","Barwert","Barwert","Barwert","Barwert","Barwert","Barwert","Barwert","Barwert","Barwert"]
[null,null,null,null,null,null,null,null,null,null,null,null,null,null,"∑ BZR",1,2,3,4,5,6,7,8,9,10,11,12,13,14,15,16,17,18,19,20,21,22,23,24,25,26,27,28,29,30,31,32,33,34,35,36,37,38,39,40,41,42,43,44,45,46,47,48,49,50,51,52,53,54,55,56,57,58,59,60,61,62,63,64,65,66,67,68,69,70,71,72,73,74,75,76,77,78,79,80]
[null,null,null,null,null,null,null,null,null,null,null,null,null,{"$f":"SUM(N8:N25)","v":34000},1931793.2702247081,34167.487684729065,34335.800431944488,34504.942305993471,34674.917391244686,34845.729792186779,35017.383633527606,35189.883060293752,35363.232237930672,35537.435352403241,35712.496610296854,35888.42023891901,36065.210486401389,36242.871621802376,36421.407935210278,36600.823737846782,36781.123362171158,36962.311161984821,37144.391512536466,37327.368810627777,37511.247474719552,37696.031945038383,37881.72668368389,38068.33617473652,38255.864924365771,38444.317460939004,38633.698335130837,38824.012120032952,39015.263411264663,39207.456827083683,39400.597008497913,{"$f":"SUM(AT8:AT25)","v":39594.688619377208},39789.736346566264,39985.744899997633,40182.719012805508,40380.663441440025,40579.582965782101,40779.482389258868,40980.366538959664,41182.24026575256,41385.108444401601,41588.97597368437,41793.847776510403,41999.728800040015,42206.624015803769,42414.538419822507,42623.477032728049,42833.444899884336,43044.447091509399,43256.488702797637,43469.574854042949,0,0,0,0,0,0,0,0,0,0,0,0,{"$f":"SUM(BZ8:BZ25)","v":0},0,0,0,0,0,0,0,0,0,0,0,0,0,0,0,0,0]
[]
[1,null,null,null,"00001; keramische Fliesen; normal",{"$f":"IF(ISTEXT(VLOOKUP($E9,KatalogBodenreinigung,3,0)),VLOOKUP($E9,KatalogBodenreinigung,3,0),\"\")","v":"wischbar"},{"$f":"IF(ISTEXT(VLOOKUP($E9,KatalogBodenreinigung,4,0)),VLOOKUP($E9,KatalogBodenreinigung,4,0),\"\")","v":"keramische Fliesen"},{"$f":"IF(ISTEXT(VLOOKUP($E9,KatalogBodenreinigung,5,0)),VLOOKUP($E9,KatalogBodenreinigung,5,0),\"\")","v":"normal"},{"$f":"IF(ISNUMBER(VLOOKUP($E9,KatalogBodenreinigung,6,0)),VLOOKUP($E9,KatalogBodenreinigung,6,0),\"\")","v":17},{"$f":"IF(ISNUMBER(VLOOKUP($E9,KatalogBodenreinigung,7,0)),VLOOKUP($E9,KatalogBodenreinigung,7,0),\"\")","v":250},{"$f":"IF(ISNUMBER(VLOOKUP($E9,KatalogBodenreinigung,8,0)),VLOOKUP($E9,KatalogBodenreinigung,8,0),\"\")","v":100},{"$f":"IF(ISNUMBER(I9/J9),I9/J9,\"\")","v":6.8000000000000005E-2},{"$f":"(IF(ISNUMBER(L9*K9),L9*K9,\"\"))","v":6.8000000000000007},{"$f":"IF(ISNUMBER(M9*D9),M9*D9,\"\")","v":0},{"$f":"SUM(OFFSET(P9,,,,BZBNB))","v":0},{"$f":"IF(AND(ISNUMBER($N9),ISNUMBER($N9*POWER(1+PSBNB,P$6)*POWER(1+KALBNB,-P$6)),P$6<BZBNB+1),$N9*POWER(1+PSBNB,P$6)*POWER(1+KALBNB,-P$6),\"\")","v":0},0,0,0,0,0,0,0,0,0,{"$f":"IF(AND(ISNUMBER($N9),ISNUMBER($N9*POWER(1+PSBNB,Z$6)*POWER(1+KALBNB,-Z$6)),Z$6<BZBNB+1),$N9*POWER(1+PSBNB,Z$6)*POWER(1+KALBNB,-Z$6),\"\")","v":0},0,0,0,0,0,0,0,0,0,{"$f":"IF(AND(ISNUMBER($N9),ISNUMBER($N9*POWER(1+PSBNB,AJ$6)*POWER(1+KALBNB,-AJ$6)),AJ$6<BZBNB+1),$N9*POWER(1+PSBNB,AJ$6)*POWER(1+KALBNB,-AJ$6),\"\")","v":0},0,0,0,0,0,0,0,0,0,{"$f":"IF(AND(ISNUMBER($N9),ISNUMBER($N9*POWER(1+PSBNB,AT$6)*POWER(1+KALBNB,-AT$6)),AT$6<BZBNB+1),$N9*POWER(1+PSBNB,AT$6)*POWER(1+KALBNB,-AT$6),\"\")","v":0},0,0,0,0,0,0,0,0,0,{"$f":"IF(AND(ISNUMBER($N9),ISNUMBER($N9*POWER(1+PSBNB,BD$6)*POWER(1+KALBNB,-BD$6)),BD$6<BZBNB+1),$N9*POWER(1+PSBNB,BD$6)*POWER(1+KALBNB,-BD$6),\"\")","v":0},0,0,0,0,0,0,0,0,0,{"$f":"IF(AND(ISNUMBER($N9),ISNUMBER($N9*POWER(1+PSBNB,BN$6)*POWER(1+KALBNB,-BN$6)),BN$6<BZBNB+1),$N9*POWER(1+PSBNB,BN$6)*POWER(1+KALBNB,-BN$6),\"\")","v":""},"","","","","","","","","",{"$f":"IF(AND(ISNUMBER($N9),ISNUMBER($N9*POWER(1+PSBNB,BX$6)*POWER(1+KALBNB,-BX$6)),BX$6<BZBNB+1),$N9*POWER(1+PSBNB,BX$6)*POWER(1+KALBNB,-BX$6),\"\")","v":""},"","","","","","","","","",{"$f":"IF(AND(ISNUMBER($N9),ISNUMBER($N9*POWER(1+PSBNB,CH$6)*POWER(1+KALBNB,-CH$6)),CH$6<BZBNB+1),$N9*POWER(1+PSBNB,CH$6)*POWER(1+KALBNB,-CH$6),\"\")","v":""},"","","","","","","","",""]
[2,null,null,null,"00002; Natur-/ Werkstein (weich); normal","wischbar","Natur-/ Werkstein (weich)","normal",17,250,100,6.8000000000000005E-2,6.8000000000000007,0,0,0,0,0,0,0,0,0,0,0,0,0,0,0,0,0,0,0,0,0,0,0,0,0,0,0,0,0,0,0,0,0,0,0,0,0,0,0,0,0,0,0,0,0,0,0,0,0,0,0,0,"","","","","","","","","","","","","","","","","","","","","","","","","","","","","",""]
[3,null,null,4000,"00003; Textilbelag; normal","nicht wischbar","Textilbelag","normal",17,300,100,5.6666666666666664E-2,5.6666666666666661,22666.666666666664,1287862.1801498055,22778.32512315271,22890.533621296323,23003.294870662314,23116.611594163121,23230.486528124518,23344.922422351738,23459.922040195834,23575.488158620446,23691.623568268828,23808.331073531237,23925.613492612672,24043.473657600924,24161.91441453492,24280.938623473518,24400.549158564521,24520.748908114107,24641.540774656547,24762.927675024308,24884.912540418518,25007.498316479701,25130.68796335892,25254.484455789257,25378.89078315768,25503.909949577181,25629.544973959335,25755.798890087222,25882.674746688634,26010.175607509773,26138.304551389123,26267.064672331941,26396.459079584802,26526.490897710843,26657.163266665091,26788.479341870338,26920.442294293349,27053.055310521398,27186.321592839242,27320.244359306442,27454.826843835039,27590.072296267732,27725.98398245624,27862.565184340267,27999.819200026672,28137.749343869182,28276.358946548338,28415.651355152033,28555.629933256223,28696.298061006266,28837.659135198424,28979.716569361961,"","","","","","","","","","","","","","","","","","","","","","","","","","","","","",""]
[4,null,null,null,"00004; Kunststoff; normal","wischbar","Kunststoff","normal",17,400,100,4.2500000000000003E-2,4.25,0,0,0,0,0,0,0,0,0,0,0,0,0,0,0,0,0,0,0,0,0,0,0,0,0,0,0,0,0,0,0,0,0,0,0,0,0,0,0,0,0,0,0,0,0,0,0,0,0,0,0,0,"","","","","","","","","","","","","","","","","","","","","","","","","","","","","",""]
[5,null,null,null,"00005; Laminat; normal","wischbar","Laminat","normal",17,400,100,4.2500000000000003E-2,4.25,0,0,0,0,0,0,0,0,0,0,0,0,0,0,0,0,0,0,0,0,0,0,0,0,0,0,0,0,0,0,0,0,0,0,0,0,0,0,0,0,0,0,0,0,0,0,0,0,0,0,0,0,"","","","","","","","","","","","","","","","","","","","","","","","","","","","","",""]
[6,null,null,2000,"00006; Linoleum; normal","wischbar","Linoleum","normal",17,400,100,4.2500000000000003E-2,4.25,8500,482948.31755617715,8541.8719211822663,8583.950107986122,8626.2355764983695,8668.7293478111715,8711.4324480466948,8754.3459083819016,8797.4707650734381,8840.8080594826697,8884.3588381008103,8928.1241525742153,8972.1050597297526,9016.3026216003473,9060.7179054505941,9105.3519838025713,9150.2059344616955,9195.2808405427913,9240.5777904962051,9286.0978781341164,9331.842202656946,9377.8118686798898,9424.007986259594,9470.4316709209743,9517.0840436841299,9563.9662310914428,9611.0793652347511,9658.4245837827093,9706.0030300082381,9753.8158528161657,9801.8642067709225,9850.1492521244782,9898.6721548443038,9947.4340866415678,9996.4362249994101,10045.679753201379,10095.165860360006,10144.895741445525,10194.870597314717,10245.091634739916,10295.56006643814,10346.2771111004,10397.243993421092,10448.461944127603,10499.932200010004,10551.656003950946,10603.634604955627,10655.869258182014,10708.361224971086,10761.11177287735,10814.122175699411,10867.393713510737,"","","","","","","","","","","","","","","","","","","","","","","","","","","","","",""]
[7,null,null,null,"00007; Parkett; normal","wischbar","Parkett","normal",17,400,100,4.2500000000000003E-2,4.25,0,0,0,0,0,0,0,0,0,0,0,0,0,0,0,0,0,0,0,0,0,0,0,0,0,0,0,0,0,0,0,0,0,0,0,0,0,0,0,0,0,0,0,0,0,0,0,0,0,0,0,0,"","","","","","","","","","","","","","","","","","","","","","","","","","","","","",""]
[null,null,null,null,null,"","","","","","","","","",0,"","","","","","","","","","","","","","","","","","","","","","","","","","","","","","","","","","","","","","","","","","","","","","","","","","","","","","","","","","","","","","","","","","","","","","","","","","","","","","","",""]
[8,null,null,null,"00008; keramische Fliesen; stark","wischbar","keramische Fliesen","stark",17,200,100,8.5000000000000006E-2,8.5,0,0,0,0,0,0,0,0,0,0,0,0,0,0,0,0,0,0,0,0,0,0,0,0,0,0,0,0,0,0,0,0,0,0,0,0,0,0,0,0,0,0,0,0,0,0,0,0,0,0,0,0,"","","","","","","","","","","","","","","","","","","","","","","","","","","","","",""]
[9,null,null,500,"00009; Natur-/ Werkstein (hart); stark","wischbar","Natur-/ Werkstein (hart)","stark",17,300,100,5.6666666666666664E-2,5.6666666666666661,2833.333333333333,160982.77251872569,2847.2906403940888,2861.3167026620404,2875.4118588327892,2889.5764492703902,2903.8108160155648,2918.1153027939672,2932.4902550244792,2946.9360198275558,2961.4529460336034,2976.0413841914046,2990.7016865765841,3005.4342072001155,3020.239301816865,3035.1173279341897,3050.0686448205652,3065.0936135142633,3080.1925968320684,3095.3659593780385,3110.6140675523147,3125.9372895599627,3141.335995419865,3156.8105569736572,3172.36134789471,3187.9887436971476,3203.6931217449169,3219.4748612609028,3235.3343433360792,3251.2719509387216,3267.2880689236404,3283.3830840414926,3299.5573849481002,3315.8113622138553,3332.1454083331364,3348.5599177337922,3365.0552867866686,3381.6319138151748,3398.2901991049052,3415.0305449133052,3431.8533554793798,3448.7590370334665,3465.7479978070301,3482.8206480425333,3499.977400003334,3517.2186679836477,3534.5448683185423,3551.9564193940041,3569.4537416570279,3587.0372576257832,3604.707391899803,3622.4645711702451,"","","","","","","","","","","","","","","","","","","","","","","","","","","","","",""]
[10,null,null,null,"00010; Textilbelag; stark","nicht wischbar","Textilbelag","stark",17,250,100,6.8000000000000005E-2,6.8000000000000007,0,0,0,0,0,0,0,0,0,0,0,0,0,0,0,0,0,0,0,0,0,0,0,0,0,0,0,0,0,0,0,0,0,0,0,0,0,0,0,0,0,0,0,0,0,0,0,0,0,0,0,0,"","","","","","","","","","","","","","","","","","","","","","","","","","","","","",""]
[11,null,null,null,"00011; Kunststoff; stark","wischbar","Kunststoff","stark",17,300,100,5.6666666666666664E-2,5.6666666666666661,0,0,0,0,0,0,0,0,0,0,0,0,0,0,0,0,0,0,0,0,0,0,0,0,0,0,0,0,0,0,0,0,0,0,0,0,0,0,0,0,0,0,0,0,0,0,0,0,0,0,0,0,"","","","","","","","","","","","","","","","","","","","","","","","","","","","","",""]
[12,null,null,null,"00012; Laminat; stark","wischbar","Laminat","stark",17,300,100,5.6666666666666664E-2,5.6666666666666661,0,0,0,0,0,0,0,0,0,0,0,0,0,0,0,0,0,0,0,0,0,0,0,0,0,0,0,0,0,0,0,0,0,0,0,0,0,0,0,0,0,0,0,0,0,0,0,0,0,0,0,0,"","","","","","","","","","","","","","","","","","","","","","","","","","","","","",""]
[13,null,null,null,"00013; Linoleum; stark","wischbar","Linoleum","stark",17,300,100,5.6666666666666664E-2,5.6666666666666661,0,0,0,0,0,0,0,0,0,0,0,0,0,0,0,0,0,0,0,0,0,0,0,0,0,0,0,0,0,0,0,0,0,0,0,0,0,0,0,0,0,0,0,0,0,0,0,0,0,0,0,0,"","","","","","","","","","","","","","","","","","","","","","","","","","","","","",""]
[14,null,null,null,"00014; Parkett; stark","wischbar","Parkett","stark",17,200,100,8.5000000000000006E-2,8.5,0,0,0,0,0,0,0,0,0,0,0,0,0,0,0,0,0,0,0,0,0,0,0,0,0,0,0,0,0,0,0,0,0,0,0,0,0,0,0,0,0,0,0,0,0,0,0,0,0,0,0,0,"","","","","","","","","","","","","","","","","","","","","","","","","","","","","",""]
[]
[{"$f":"(MAX(A$8:A$24))+1","v":15},null,null,null,null,{"$f":"IF(ISTEXT(VLOOKUP($E25,KatalogBodenreinigung,3,0)),VLOOKUP($E25,KatalogBodenreinigung,3,0),\"\")","v":""},{"$f":"IF(ISTEXT(VLOOKUP($E25,KatalogBodenreinigung,4,0)),VLOOKUP($E25,KatalogBodenreinigung,4,0),\"\")","v":""},{"$f":"IF(ISTEXT(VLOOKUP($E25,KatalogBodenreinigung,5,0)),VLOOKUP($E25,KatalogBodenreinigung,5,0),\"\")","v":""},{"$f":"IF(ISNUMBER(VLOOKUP($E25,KatalogBodenreinigung,6,0)),VLOOKUP($E25,KatalogBodenreinigung,6,0),\"\")","v":""},{"$f":"IF(ISNUMBER(VLOOKUP($E25,KatalogBodenreinigung,7,0)),VLOOKUP($E25,KatalogBodenreinigung,7,0),\"\")","v":""},{"$f":"IF(ISNUMBER(VLOOKUP($E25,KatalogBodenreinigung,8,0)),VLOOKUP($E25,KatalogBodenreinigung,8,0),\"\")","v":""},{"$f":"IF(ISNUMBER(I25/J25),I25/J25,\"\")","v":""},{"$f":"(IF(ISNUMBER(L25*K25),L25*K25,\"\"))","v":""},{"$f":"IF(ISNUMBER(M25*D25),M25*D25,\"\")","v":""},{"$f":"SUM(OFFSET(P25,,,,BZBNB))","v":0},{"$f":"IF(AND(ISNUMBER($N25),ISNUMBER($N25*POWER(1+PSBNB,P$6)*POWER(1+KALBNB,-P$6)),P$6<BZBNB+1),$N25*POWER(1+PSBNB,P$6)*POWER(1+KALBNB,-P$6),\"\")","v":""},"","","","","","","","","","","","","","","","","","","","","","","","","","","","","","","",{"$f":"IF(AND(ISNUMBER($N25),ISNUMBER($N25*POWER(1+PSBNB,AV$6)*POWER(1+KALBNB,-AV$6)),AV$6<BZBNB+1),$N25*POWER(1+PSBNB,AV$6)*POWER(1+KALBNB,-AV$6),\"\")","v":""},"","","","","","","","","","","","","","","","","","","","","","","","","","","","","","","",{"$f":"IF(AND(ISNUMBER($N25),ISNUMBER($N25*POWER(1+PSBNB,CB$6)*POWER(1+KALBNB,-CB$6)),CB$6<BZBNB+1),$N25*POWER(1+PSBNB,CB$6)*POWER(1+KALBNB,-CB$6),\"\")","v":""},"","","","","","","","","","","","","","",""]

{"sheet":"Energieversorgung","index":6,"n_rows":16,"n_cols":87,"rows_kept":16,"cut":false,"hidden":false,"merged":[[0,0,0,1],[1,1,1,2],[2,1,2,2]]}
["Berechnung LCC nach BNB BN 2.1.1 v2015\nEingabe Energieversorgung",null,"BBR-LCC\nVer. 15-1\nBBR A1"]
["Projekt:",{"$f":"IF(ISTEXT(Projekt),Projekt,\"\")","v":"Beispieleingabe\n\n(Szenario: 10 Mio Euro netto Herstellungskosten für KG 300 und 400)\n"}]
["Stand:",{"$f":"IF(ISNUMBER(LCC_Stand),LCC_Stand,\"\")","v":"2018-01-08"}]
[]
["Nr.","Bezeichnung","Energieträger","Heizwert Endenergiebedarf \nabsolut","Energiekosten netto BNB","jährliche Energiekosten BNB","Barwert","Barwert","Barwert","Barwert","Barwert","Barwert","Barwert","Barwert","Barwert","Barwert","Barwert","Barwert","Barwert","Barwert","Barwert","Barwert","Barwert","Barwert","Barwert","Barwert","Barwert","Barwert","Barwert","Barwert","Barwert","Barwert","Barwert","Barwert","Barwert","Barwert","Barwert","Barwert","Barwert","Barwert","Barwert","Barwert","Barwert","Barwert","Barwert","Barwert","Barwert","Barwert","Barwert","Barwert","Barwert","Barwert","Barwert","Barwert","Barwert","Barwert","Barwert","Barwert","Barwert","Barwert","Barwert","Barwert","Barwert","Barwert","Barwert","Barwert","Barwert","Barwert","Barwert","Barwert","Barwert","Barwert","Barwert","Barwert","Barwert","Barwert","Barwert","Barwert","Barwert","Barwert","Barwert","Barwert","Barwert","Barwert","Barwert","Barwert","Barwert"]
[null,null,null,"kWh","€ / kWh","€","∑ BZR",1,2,3,4,5,6,7,8,9,10,11,12,13,14,15,16,17,18,19,20,21,22,23,24,25,26,27,28,29,30,31,32,33,34,35,36,37,38,39,40,41,42,43,44,45,46,47,48,49,50,51,52,53,54,55,56,57,58,59,60,61,62,63,64,65,66,67,68,69,70,71,72,73,74,75,76,77,78,79,80]
[null,null,null,{"$f":"SUM(D8:D16)","v":750000},null,{"$f":"SUM(F8:F16)","v":73000},9739080.131091997,75517.241379310348,78121.284185493481,80815.121571200172,83601.849901241585,86484.672311629227,89466.902391340569,92551.967991042009,95743.415163146914,99044.912237738201,102460.25403903952,105993.36624728231,109648.30991098168,113429.28611480867,117340.64080842274,121386.86980181672,125572.6239329138,129902.71441335915,134382.11835864742,139015.98450894561,143809.63914718517,148768.59222122605,153898.54367713039,159205.3900108246,164695.23104568064,170374.37694380755,176249.35545911131,182326.91944046004,188614.05459357935,195117.98751059934,201846.19397648211,{"$f":"SUM(AL8:AL16)","v":208806.40756187815},216006.62851228769,223455.13294374596,231160.48235559929,239131.53347130967,247377.44841859624,255907.70526061684,264732.10889029328,273860.80230030353,283304.27824169322,293073.39128451032,303179.37029432104,313633.83133895282,324448.7910402962,335636.6803865133,347210.359020531,359183.13002123911,371568.75519438542,384381.4708907436,397636.00436973473,0,0,0,0,0,0,0,0,0,0,0,0,{"$f":"SUM(BR8:BR16)","v":0},0,0,0,0,0,0,0,0,0,0,0,0,0,0,0,0,0]
[]
[1,"Endenergiebedarf Heizwärme laut EnEV","Gas - Erdgas",550000,{"$f":"IF(ISNUMBER(VLOOKUP(C9,Energieträger_Verweis,3,0)),VLOOKUP(C9,Energieträger_Verweis,3,0),\"\")","v":0.06},{"$f":"IF(ISNUMBER(E9*D9),E9*D9,\"\")","v":33000},{"$f":"SUM(OFFSET(H9,,,,BZBNB))","v":4402597.8674799437},{"$f":"IF(AND(ISNUMBER($F9),ISNUMBER($F9*POWER(1+PSEBNB,H$6)*POWER(1+KALBNB,-H$6)),H$6<BZBNB+1),$F9*POWER(1+PSEBNB,H$6)*POWER(1+KALBNB,-H$6),\"\")","v":34137.931034482761},35315.101070154589,36532.863176022001,37792.617078643452,39095.810771010467,40443.942176907382,41838.560872662827,43281.269868271891,44773.727449936443,46317.649086141158,47914.809399456375,49567.044206334183,51276.252627242277,53044.39926956097,54873.516485752756,56765.706709399397,58723.144871792501,60748.080901854308,62842.842312263085,65009.836874754932,67251.555387677523,69570.574538976769,71969.55986790701,74451.268828869332,77018.553960899313,79674.36616644758,82421.758103221655,85263.887692987933,88204.021751366818,91245.539742793277,94391.937664958605,97646.832067198542,{"$f":"IF(AND(ISNUMBER($F9),ISNUMBER($F9*POWER(1+PSEBNB,AN$6)*POWER(1+KALBNB,-AN$6)),AN$6<BZBNB+1),$F9*POWER(1+PSEBNB,AN$6)*POWER(1+KALBNB,-AN$6),\"\")","v":101013.9642074468},104497.20435253119,108100.55622675642,111828.16161388597,115684.30511781308,119673.41908739285,123800.08871109612,128069.05728734078,132485.23167655946,137053.68794126841,141779.67718062253,146668.63156616129,151726.1705856841,156958.10750243181,162370.45603699848,167969.43727965365,173761.48684102105,179753.26224933213,"","","","","","","","","","","","","","",{"$f":"IF(AND(ISNUMBER($F9),ISNUMBER($F9*POWER(1+PSEBNB,BT$6)*POWER(1+KALBNB,-BT$6)),BT$6<BZBNB+1),$F9*POWER(1+PSEBNB,BT$6)*POWER(1+KALBNB,-BT$6),\"\")","v":""},"","","","","","","","","","","","","","",""]
[2,"Endenergiebedarf Warmwasserbereitung laut EnEV","Elektroenergie - Strom-Mix - Arbeit",40000,{"$f":"IF(ISNUMBER(VLOOKUP(C10,Energieträger_Verweis,3,0)),VLOOKUP(C10,Energieträger_Verweis,3,0),\"\")","v":0.2},8000,{"$f":"SUM(OFFSET(H10,,,,BZBNB))","v":1067296.4527224109},{"$f":"IF(AND(ISNUMBER($F10),ISNUMBER($F10*POWER(1+PSEBNB,H$6)*POWER(1+KALBNB,-H$6)),H$6<BZBNB+1),$F10*POWER(1+PSEBNB,H$6)*POWER(1+KALBNB,-H$6),\"\")","v":8275.8620689655181},8561.2366230677799,8856.4516790356356,9161.8465645196229,9477.7723081237491,9804.5920428866393,10142.681423675836,10492.429058975003,10854.23695756035,11228.520990579673,11615.711369565182,12016.253140929501,12430.606697513278,12859.248307772357,13302.67066321279,13761.383444702884,14235.913908313332,14726.807491358622,15234.628439336506,15759.960454486045,16303.407366709705,16865.593827630728,17447.166028583517,18048.792443362261,18671.16459658165,19314.997858532748,19981.032267447674,20670.033380118286,21382.793151846501,22120.130846737764,22882.893979383902,23671.959289017832,{"$f":"IF(AND(ISNUMBER($F10),ISNUMBER($F10*POWER(1+PSEBNB,AN$6)*POWER(1+KALBNB,-AN$6)),AN$6<BZBNB+1),$F10*POWER(1+PSEBNB,AN$6)*POWER(1+KALBNB,-AN$6),\"\")","v":24488.23374725983},25332.655600613623,26206.19544891065,27109.857360942053,28044.680028560746,29011.737960580085,30012.142717841481,31047.044190870492,32117.631921590168,33225.136470610523,34370.83083166607,35556.031894826971,36782.101960165841,38050.450303619837,39362.534796848122,40719.863582946338,42123.996809944503,43576.548424080516,{"$f":"IF(AND(ISNUMBER($F10),ISNUMBER($F10*POWER(1+PSBNB,BF$6)*POWER(1+KALBNB,-BF$6)),BF$6<BZBNB+1),$F10*POWER(1+PSBNB,BF$6)*POWER(1+KALBNB,-BF$6),\"\")","v":""},"","","","","","","","","","","","","",{"$f":"IF(AND(ISNUMBER($F10),ISNUMBER($F10*POWER(1+PSBNB,BT$6)*POWER(1+KALBNB,-BT$6)),BT$6<BZBNB+1),$F10*POWER(1+PSBNB,BT$6)*POWER(1+KALBNB,-BT$6),\"\")","v":""},"","","","","","","","","","","","","","",""]
[3,"Endenergiebedarf Luftförderung laut EnEV","Elektroenergie - Strom-Mix - Arbeit",30000,0.2,6000,{"$f":"SUM(OFFSET(H11,,,,BZBNB))","v":800472.33954180812},6206.8965517241386,6420.927467300834,6642.3387592767267,6871.3849233897181,7108.3292310928127,7353.4440321649781,7607.0110677568773,7869.3217942312531,8140.6777181702628,8421.3907429347546,8711.7835271738859,9012.1898556971246,9322.9550231349604,9644.4362308292675,9977.0029974095924,10321.037583527162,10676.935431235001,11045.105618518966,11425.971329502379,11819.970340864533,12227.555525032278,12649.195370723048,13085.374521437639,13536.594332521698,14003.373447436237,14486.248393899559,14985.774200585754,15502.525035088713,16037.094863884879,16590.098135053322,17162.170484537928,17753.969466763374,18366.175310444873,18999.491700460214,19654.646586682986,20332.393020706535,21033.510021420559,21758.803470435061,22509.107038381109,23285.283143152868,24088.223941192628,24918.852352957892,25778.123123749549,26667.023921120235,27586.576470124379,28537.837727714876,29521.901097636088,30539.897687209756,31592.997607458376,32682.411318060385,"","","","","","","","","","","","","","","","","","","","","","","","","","","","","",""]
[4,"Endenergiebedarf Klimakälte laut EnEV","Elektroenergie - Strom-Mix - Arbeit",20000,0.2,4000,{"$f":"SUM(OFFSET(H12,,,,BZBNB))","v":533648.22636120545},4137.9310344827591,4280.6183115338899,4428.2258395178178,4580.9232822598115,4738.8861540618745,4902.2960214433197,5071.3407118379182,5246.2145294875017,5427.1184787801749,5614.2604952898364,5807.8556847825912,6008.1265704647503,6215.303348756639,6429.6241538861786,6651.3353316063949,6880.691722351442,7117.9569541566661,7363.4037456793112,7617.3142196682529,7879.9802272430225,8151.7036833548527,8432.796913815364,8723.5830142917584,9024.3962216811306,9335.5822982908248,9657.498929266374,9990.5161337238369,10335.016690059143,10691.396575923251,11060.065423368882,11441.446989691951,11835.979644508916,12244.116873629915,12666.327800306812,13103.097724455325,13554.928680471026,14022.340014280373,14505.868980290043,15006.071358920741,15523.522095435246,16058.815960795084,16612.568235305262,17185.415415833035,17778.015947413485,18391.05098008292,19025.225151809918,19681.267398424061,20359.931791473169,21061.998404972252,21788.274212040258,"","","","","","","","","","","","","","","","","","","","","","","","","","","","","",""]
[5,"Endenergiebedarf Beleuchtung laut EnEV","Elektroenergie - Strom-Mix - Arbeit",60000,0.2,12000,{"$f":"SUM(OFFSET(H13,,,,BZBNB))","v":1600944.6790836162},12413.793103448277,12841.854934601668,13284.677518553453,13742.769846779436,14216.658462185625,14706.888064329956,15214.022135513755,15738.643588462506,16281.355436340526,16842.781485869509,17423.567054347772,18024.379711394249,18645.910046269921,19288.872461658535,19954.005994819185,20642.075167054325,21353.870862470001,22090.211237037933,22851.942659004759,23639.940681729066,24455.111050064555,25298.390741446095,26170.749042875279,27073.188665043395,28006.746894872475,28972.496787799118,29971.548401171509,31005.050070177425,32074.189727769757,33180.196270106644,34324.340969075856,35507.938933526748,36732.350620889745,37998.983400920428,39309.293173365972,40664.78604141307,42067.020042841119,43517.606940870122,45018.214076762219,46570.566286305737,48176.447882385255,49837.704705915785,51556.246247499097,53334.04784224047,55173.152940248758,57075.675455429751,59043.802195272176,61079.795374419511,63185.995214916751,65364.822636120771,"","","","","","","","","","","","","","","","","","","","","","","","","","","","","",""]
[6,"Endenergiebedarf Hilfsenergie laut EnEV","Elektroenergie - Strom-Mix - Arbeit",50000,0.2,10000,{"$f":"SUM(OFFSET(H14,,,,BZBNB))","v":1334120.5659030136},10344.827586206899,10701.545778834725,11070.564598794545,11452.30820564953,11847.215385154686,12255.740053608299,12678.351779594796,13115.536323718754,13567.796196950438,14035.651238224593,14519.639211956477,15020.316426161877,15538.258371891599,16074.060384715445,16628.338329015984,17201.729305878605,17794.892385391668,18408.509364198275,19043.285549170632,19699.950568107557,20379.259208387131,21081.99228453841,21808.957535729398,22560.990554202828,23338.955745727064,24143.747323165931,24976.29033430959,25837.541725147854,26728.491439808131,27650.163558422206,28603.617474229883,29589.94911127229,30610.292184074788,31665.819500767029,32757.744311138315,33887.321701177563,35055.850035700932,36264.672450725106,37515.178397301854,38808.805238588116,40147.039901987715,41531.420588263158,42963.538539582587,44445.03986853372,45977.627450207299,47563.062879524798,49203.168496060149,50899.829478682921,52654.996012430631,54470.685530100644,"","","","","","","","","","","","","","","","","","","","","","","","","","","","","",""]
[null,null,null,null,""]
[{"$f":"(MAX(A$8:A$15))+1","v":7},null,null,null,"",{"$f":"IF(ISNUMBER(E16*D16),E16*D16,\"\")","v":""},{"$f":"SUM(OFFSET(H16,,,,BZBNB))","v":0},"","","","","","","","","","","","","","","","","","","","","","","","","","","","","","","","","","","","","","","","","","","","","","","","","","","","","","","","","","","","","","","","","","","","","","","","","","","","","","","",""]

{"sheet":"Wasser_Abwasser","index":7,"n_rows":11,"n_cols":86,"rows_kept":11,"cut":false,"hidden":false,"merged":[[0,0,0,1],[1,1,1,3],[2,1,2,3]]}
["Berechnung LCC nach BNB BN 2.1.1 v2015\nEingabe Wasser- und Abwasserkosten",null,null,"BBR-LCC\nVer. 15-1\nBBR A1"]
["Projekt:",{"$f":"IF(ISTEXT(Projekt),Projekt,\"\")","v":"Beispieleingabe\n\n(Szenario: 10 Mio Euro netto Herstellungskosten für KG 300 und 400)\n"}]
["Stand:",{"$f":"IF(ISNUMBER(LCC_Stand),LCC_Stand,\"\")","v":"2018-01-08"}]
[]
["Bezeichnung","Menge","ME","Preis BNB ","jährliche Kosten für Wasserver- und Entsorgung","Barwert","Barwert","Barwert","Barwert","Barwert","Barwert","Barwert","Barwert","Barwert","Barwert","Barwert","Barwert","Barwert","Barwert","Barwert","Barwert","Barwert","Barwert","Barwert","Barwert","Barwert","Barwert","Barwert","Barwert","Barwert","Barwert","Barwert","Barwert","Barwert","Barwert","Barwert","Barwert","Barwert","Barwert","Barwert","Barwert","Barwert","Barwert","Barwert","Barwert","Barwert","Barwert","Barwert","Barwert","Barwert","Barwert","Barwert","Barwert","Barwert","Barwert","Barwert","Barwert","Barwert","Barwert","Barwert","Barwert","Barwert","Barwert","Barwert","Barwert","Barwert","Barwert","Barwert","Barwert","Barwert","Barwert","Barwert","Barwert","Barwert","Barwert","Barwert","Barwert","Barwert","Barwert","Barwert","Barwert","Barwert","Barwert","Barwert","Barwert","Barwert"]
[null,"pro ME",null,"€ / ME","€","∑ BZR",1,2,3,4,5,6,7,8,9,10,11,12,13,14,15,16,17,18,19,20,21,22,23,24,25,26,27,28,29,30,31,32,33,34,35,36,37,38,39,40,41,42,43,44,45,46,47,48,49,50,51,52,53,54,55,56,57,58,59,60,61,62,63,64,65,66,67,68,69,70,71,72,73,74,75,76,77,78,79,80]
[null,null,null,null,{"$f":"SUM(E9:E11)","v":9400},{"$f":"SUM(F8:F11)","v":534084.02176800766},9446.3054187192138,9492.8389429493582,9539.6016963629008,9586.594808167647,9633.8194131339915,9681.2766516223382,9728.9676696106253,9776.8936187220097,9825.0556562526617,9873.4549451997209,9922.092654289374,9970.9699580050892,10020.088036615951,10069.448076205194,10119.051268698815,10168.898811894378,10218.991909489921,10269.331771113022,10319.919612350033,10370.756654775407,10421.844125981199,10473.183259606722,10524.775295368332,10576.621479089361,10628.723062730194,10681.081304418523,10733.697468479699,10786.572825467289,10839.708652193725,10893.106231761187,10946.766853592522,{"$f":"SUM(AL8:AL11)","v":11000.691813462439},11054.882413528758,11109.339962363878,11164.06577498636,11219.061172892696,11274.327484089215,11329.866043124142,11385.678191119827,11441.765275805148,11498.128651548031,11554.76967938817,11611.689727069886,11668.890169075163,11726.372386656811,11784.137767871875,11842.187707615081,11900.523607652598,11959.146876655817,12018.058930235402,0,0,0,0,0,0,0,0,0,0,0,0,0,{"$f":"SUM(BR8:BR11)","v":0},0,0,0,0,0,0,0,0,0,0,0,0,0,0,0,0]
[]
["Gesamtfrischwasserbedarf\naus Berechnungshilfe Trinkwasser (Tool 1.2.3)",2000,"m³",{"$f":"Kosten_Frischwasserbedarf","v":2.0099999999999998},{"$f":"D9*B9","v":4019.9999999999995},{"$f":"SUM(OFFSET(G9,,,,BZBNB))","v":228406.14547950972},{"$f":"IF(AND(ISNUMBER($E9),ISNUMBER($E9*POWER(1+PSBNB,G$6)*POWER(1+KALBNB,-G$6)),G$6<BZBNB+1),$E9*POWER(1+PSBNB,G$6)*POWER(1+KALBNB,-G$6),\"\")","v":4039.8029556650249},4059.7034628357892,4079.702002061581,4099.7990562589302,4119.99511072326,4140.290653140617,4160.686173599438,4181.1821646023909,4201.7791210782661,4222.4775403939229,{"$f":"IF(AND(ISNUMBER($E9),ISNUMBER($E9*POWER(1+PSBNB,Q$6)*POWER(1+KALBNB,-Q$6)),Q$6<BZBNB+1),$E9*POWER(1+PSBNB,Q$6)*POWER(1+KALBNB,-Q$6),\"\")","v":4243.2779223663065},4264.1807692745169,4285.1865858719275,4306.2958793983917,4327.5091595924723,4348.8269387037662,4370.2497315052642,4391.7780553057819,4413.4124299624609,4435.1533778933117,{"$f":"IF(AND(ISNUMBER($E9),ISNUMBER($E9*POWER(1+PSBNB,AA$6)*POWER(1+KALBNB,-AA$6)),AA$6<BZBNB+1),$E9*POWER(1+PSBNB,AA$6)*POWER(1+KALBNB,-AA$6),\"\")","v":4457.0014240898308},4478.9570961296831,4501.0209241894354,4523.1934410573649,4545.4751821463169,4567.8666855066449,4590.36849183919,4612.9811445083506,4635.7051895551886,4658.5411757106349,{"$f":"IF(AND(ISNUMBER($E9),ISNUMBER($E9*POWER(1+PSBNB,AK$6)*POWER(1+KALBNB,-AK$6)),AK$6<BZBNB+1),$E9*POWER(1+PSBNB,AK$6)*POWER(1+KALBNB,-AK$6),\"\")","v":4681.4896544087169},4704.5511797998943,4727.726308764426,4751.015600925828,4774.4196186643794,4797.9389271307064,4821.5740942594302,4845.3256907828772,4869.1942902448609,4893.1804690145418,{"$f":"IF(AND(ISNUMBER($E9),ISNUMBER($E9*POWER(1+PSBNB,AU$6)*POWER(1+KALBNB,-AU$6)),AU$6<BZBNB+1),$E9*POWER(1+PSBNB,AU$6)*POWER(1+KALBNB,-AU$6),\"\")","v":4917.2848063003285},4941.507884163877,4965.8502875341428,4990.3126042215044,5014.8954249319549,5039.5993432813757,5064.4249558098536,5089.3728619961112,5114.4436642719556,5139.6379680368418,{"$f":"IF(AND(ISNUMBER($E9),ISNUMBER($E9*POWER(1+PSBNB,BE$6)*POWER(1+KALBNB,-BE$6)),BE$6<BZBNB+1),$E9*POWER(1+PSBNB,BE$6)*POWER(1+KALBNB,-BE$6),\"\")","v":""},"","","","","","","","","",{"$f":"IF(AND(ISNUMBER($E9),ISNUMBER($E9*POWER(1+PSBNB,BO$6)*POWER(1+KALBNB,-BO$6)),BO$6<BZBNB+1),$E9*POWER(1+PSBNB,BO$6)*POWER(1+KALBNB,-BO$6),\"\")","v":""},"","","","","","","","","",{"$f":"IF(AND(ISNUMBER($E9),ISNUMBER($E9*POWER(1+PSBNB,BY$6)*POWER(1+KALBNB,-BY$6)),BY$6<BZBNB+1),$E9*POWER(1+PSBNB,BY$6)*POWER(1+KALBNB,-BY$6),\"\")","v":""},"","","","","","","","",""]
["Abwasseraufkommen aus Niederschlagswasser\naus Berechnungshilfe Trinkwasser (Tool 1.2.3)",1000,"m³",{"$f":"Kosten_Niederschlagswasser","v":1.1000000000000001},{"$f":"D10*B10","v":1100},{"$f":"SUM(OFFSET(G10,,,,BZBNB))","v":62499.194036681743},1105.4187192118229,1110.8641316217336,1116.3363687233184,1121.8355626579162,1127.3618462178076,1132.9153528494226,1138.4962166565626,1144.1045724036396,1149.7405555189284,1155.4043020978397,1161.0959489062034,1166.8156333835743,1172.5634936465476,1178.3396684920974,1184.1442974009253,1189.9775205408316,1195.8394787700972,1201.7303136408857,1207.6501674026636,1213.5991830056328,1219.5775041041829,1225.5852750603613,1231.6226409473579,1237.6897475530102,1243.7867413833208,1249.9137696659975,1256.0709803540074,1262.2585221291508,1268.4765444056488,1274.7251973337561,1281.0046318033803,1287.3149994477324,1293.6564526469824,1300.0291445319431,1306.4332289877657,1312.8688606576561,1319.3361949466102,1325.8353880251657,1332.3665968331713,1338.9299790835812,1345.5256932662592,1352.1538986518071,1358.8147552954122,1365.5084240407105,1372.2350665236695,1378.9948451764958,1385.7879232315522,1392.6144647253043,1399.4746345022766,1406.3685982190364,"","","","","","","","","","","","","","","","","","","","","","","","","","","","","",""]
["Abwasseraufkommen aus Brauchwasser\naus Berechnungshilfe Trinkwasser (Tool 1.2.3)",2000,"m³",{"$f":"Kosten_Brauchwasser","v":2.14},{"$f":"D11*B11","v":4280},{"$f":"SUM(OFFSET(G11,,,,BZBNB))","v":243178.68225181627},4301.083743842365,4322.2713484918359,4343.5633255780021,4364.9601892508008,4386.462456192924,4408.0706456322996,4429.7852793546253,4451.6068817159794,4473.5359796554676,4495.5731027079582,4517.7187830168641,4539.9735553469982,4562.3379570974766,4584.8125283147056,4607.3978117054185,4630.0943526497813,4652.90269921456,4675.8234021663548,4698.8570149849093,4722.0040938764623,4745.2651977871838,4768.6408884166785,4792.1317302315383,4815.7382904789856,4839.4611392005572,4863.3008492458812,4887.2579962865011,4911.333158829787,4935.5269182328884,4959.8398587167967,4984.2725673804252,5008.8256342148134,5033.4996521173498,5058.2952169061064,5083.2129273342152,5108.2533851043345,5133.4171948831745,5158.704964316099,5184.1173040417934,5209.6548277070251,5235.3181519814443,5261.1078965724864,5287.0246842403312,5313.0691408129469,5339.2418952011867,5365.543579414003,5391.9748285736759,5418.5362809311828,5445.2285778815858,5472.0523639795238,"","","","","","","","","","","","","","","","","","","","","","","","","","","","","",""]

{"sheet":"KT_Reinigung","index":8,"n_rows":22,"n_cols":10,"rows_kept":22,"cut":false,"hidden":true,"merged":[]}
["Bezeichnung","Nummer","Oberfläche","Typ","Einbauort","Material","Zugänglichkeit","€/h","m²/h","Anzahl je Jahr"]
[{"$f":"CONCATENATE(B2,\"; \", C2,D2,\"; \",E2,\"; \",G2)","v":"00001; Fenster, Tür, Festverglasung; außen; gut zugänglich"},"00001","Fenster, Tür, Festverglasung",null,"außen","Glas","gut zugänglich",22.5,25,2]
[{"$f":"CONCATENATE(B3,\"; \", C3,\"; \",D3,\"; \",E3,\"; \",G3)","v":"00002; Fenster, Tür, Festverglasung; ; außen; mittel zugänglich"},"00002","Fenster, Tür, Festverglasung",null,"außen","Glas","mittel zugänglich",22.5,20,2]
[{"$f":"CONCATENATE(B4,\"; \", C4,\"; \",D4,\"; \",E4,\"; \",G4)","v":"00003; Fenster, Tür, Festverglasung; ; außen; schwer zugänglich"},"00003","Fenster, Tür, Festverglasung",null,"außen","Glas","schwer zugänglich",22.5,13,2]
[{"$f":"CONCATENATE(B5,\"; \", C5,\"; \",D5,\"; \",E5,\"; \",G5)","v":"00004; Glasfläche; Geländer; außen; gut zugänglich"},"00004","Glasfläche","Geländer","außen","Glas","gut zugänglich",22.5,25,2]
[{"$f":"CONCATENATE(B6,\"; \", C6,\"; \",D6,\"; \",E6,\"; \",G6)","v":"00005; Glasfläche; Geländer; außen; mittel zugänglich"},"00005","Glasfläche","Geländer","außen","Glas","mittel zugänglich",22.5,20,2]
[{"$f":"CONCATENATE(B7,\"; \", C7,\"; \",D7,\"; \",E7,\"; \",G7)","v":"00006; Glasfläche; Geländer; außen; schwer zugänglich"},"00006","Glasfläche","Geländer","außen","Glas","schwer zugänglich",22.5,13,2]
["00007; Glasfläche; sonstige Verglasung; außen; gut zugänglich","00007","Glasfläche","sonstige Verglasung","außen","Glas","gut zugänglich",22.5,25,2]
["00008; Glasfläche; sonstige Verglasung; außen; mittel zugänglich","00008","Glasfläche","sonstige Verglasung","außen","Glas","mittel zugänglich",22.5,20,2]
["00009; Glasfläche; sonstige Verglasung; außen; schwer zugänglich","00009","Glasfläche","sonstige Verglasung","außen","Glas","schwer zugänglich",22.5,13,2]
["00010; AW-Bekleidung; Naturstein weich; außen; ","00010","AW-Bekleidung","Naturstein weich","außen","Naturstein weich",null,17,1.5,0.25]
["00011; AW-Bekleidung; Naturstein hart; außen; ","00011","AW-Bekleidung","Naturstein hart","außen","Naturstein hart",null,17,6,0.25]
["00012; AW-Bekleidung; Aluminium; außen; ","00012","AW-Bekleidung","Aluminium","außen","Aluminium",null,17,3,0.25]
["00013; AW-Bekleidung; Edelstahl; außen; ","00013","AW-Bekleidung","Edelstahl","außen","Edelstahl",null,17,3,0.25]
["00014; AW-Bekleidung; Kupferblech; außen; ","00014","AW-Bekleidung","Kupferblech","außen","Kupferblech",null,17,3,0.25]
["00015; AW-Bekleidung; Stahl korrosionsgeschützt; außen; ","00015","AW-Bekleidung","Stahl korrosionsgeschützt","außen","Stahl korrosionsgeschützt",null,17,3,0.25]
["00016; AW-Bekleidung; Glas; außen; ","00016","AW-Bekleidung","Glas","außen","Glas",null,17,20,0.25]
["00017; AW-Bekleidung; Keramik; außen; ","00017","AW-Bekleidung","Keramik","außen","Keramik",null,17,6,0.25]
["00018; AW-Bekleidung; Kunst/ Werkstein; außen; ","00018","AW-Bekleidung","Kunst/ Werkstein","außen","Kunst/ Werkstein",null,17,6,0.25]
[{"$f":"CONCATENATE(B20,\"; \", C20,\"; \",D20,\"; \",E20)","v":"00019; Türen allgemein + Innenfenster; außer Glastür außen; "},"00019","Türen allgemein + Innenfenster","außer Glastür außen",null,null,null,17,250,4]
["00020; Sanitäreinrichtung; Ansatz über m² Bodenfläche; innen; ","00020","Sanitäreinrichtung","Ansatz über m² Bodenfläche","innen",null,null,17,150,250]
["00021; Sonnenschutzfläche; Jalousie; außen; normal","00021","Sonnenschutzfläche","Jalousie","außen","Aluminium","normal",17,3,0.25]

{"sheet":"KT_Bodenreinigung","index":9,"n_rows":15,"n_cols":8,"rows_kept":15,"cut":false,"hidden":true,"merged":[]}
["Bezeichnung","Nummer","Typ","Material","Belastung","€/h","m²/h","Anzahl je Jahr"]
[{"$f":"CONCATENATE(B2,\"; \",D2,\"; \",E2)","v":"00001; keramische Fliesen; normal"},"00001","wischbar","keramische Fliesen","normal",17,250,100]
[{"$f":"CONCATENATE(B3,\"; \",D3,\"; \",E3)","v":"00002; Natur-/ Werkstein (weich); normal"},"00002","wischbar","Natur-/ Werkstein (weich)","normal",17,250,100]
[{"$f":"CONCATENATE(B4,\"; \",D4,\"; \",E4)","v":"00003; Textilbelag; normal"},"00003","nicht wischbar","Textilbelag","normal",17,300,100]
["00004; Kunststoff; normal","00004","wischbar","Kunststoff","normal",17,400,100]
["00005; Laminat; normal","00005","wischbar","Laminat","normal",17,400,100]
["00006; Linoleum; normal","00006","wischbar","Linoleum","normal",17,400,100]
["00007; Parkett; normal","00007","wischbar","Parkett","normal",17,400,100]
["00008; keramische Fliesen; stark","00008","wischbar","keramische Fliesen","stark",17,200,100]
["00009; Natur-/ Werkstein (hart); stark","00009","wischbar","Natur-/ Werkstein (hart)","stark",17,300,100]
["00010; Textilbelag; stark","00010","nicht wischbar","Textilbelag","stark",17,250,100]
["00011; Kunststoff; stark","00011","wischbar","Kunststoff","stark",17,300,100]
[{"$f":"CONCATENATE(B13,\"; \",D13,\"; \",E13)","v":"00012; Laminat; stark"},"00012","wischbar","Laminat","stark",17,300,100]
["00013; Linoleum; stark","00013","wischbar","Linoleum","stark",17,300,100]
["00014; Parkett; stark","00014","wischbar","Parkett","stark",17,200,100]

{"sheet":"KT_NDauern","index":10,"n_rows":303,"n_cols":5,"rows_kept":303,"cut":false,"hidden":true,"merged":[]}
[null,"KG","Code","Bezeichnung Kostengruppe oder Bauteil/Material","Nutzungsdauer"]
["322-111: Einzel-/Streifenfundamente  [ND: 50]",322,111,"Einzel-/Streifenfundamente",50]
["322-112: Fundamentplatten  [ND: 50]",322,112,"Fundamentplatten",50]
["323-111: Bohrpfähle, Presspfähle, Rammpfähle, Pfahlwände, Schlitzwände, Spundwände, Trägerbohlwände  [ND: 50]",323,111,"Bohrpfähle, Presspfähle, Rammpfähle, Pfahlwände, Schlitzwände, Spundwände, Trägerbohlwände",50]
["324-111: Bodenplatte  [ND: 50]",324,111,"Bodenplatte",50]
["326-111: Abdichtung gegen nichtdrückendes Wasser  [ND: 35]",326,111,"Abdichtung gegen nichtdrückendes Wasser",35]
["331-111: Mauerwerkswand  [ND: 50]",331,111,"Mauerwerkswand",50]
["331-211: Betonwand  [ND: 50]",331,211,"Betonwand",50]
["331-311: Holzwand  [ND: 50]",331,311,"Holzwand",50]
["331-411: Stahlbauwand  [ND: 50]",331,411,"Stahlbauwand",50]
["331-511: Lehmbauwand  [ND: 50]",331,511,"Lehmbauwand",50]
["331-611: Formsteine mit Betonfüllung  [ND: 50]",331,611,"Formsteine mit Betonfüllung",50]
["333-111: Mauerwerksstütze  [ND: 50]",333,111,"Mauerwerksstütze",50]
["333-211: Betonstütze  [ND: 50]",333,211,"Betonstütze",50]
["333-311: Holzstütze  [ND: 50]",333,311,"Holzstütze",50]
["333-411: Stahlstütze  [ND: 50]",333,411,"Stahlstütze",50]
["334-111: Standardtüren: Laubholz  [ND: 50]",334,111,"Standardtüren: Laubholz",50]
["334-112: Standardtüren: Metall  [ND: 50]",334,112,"Standardtüren: Metall",50]
["334-113: Standardtüren: Holzwerkstoff  [ND: 40]",334,113,"Standardtüren: Holzwerkstoff",40]
["334-114: Standardtüren: Kunststoff  [ND: 40]",334,114,"Standardtüren: Kunststoff",40]
["334-115: Standardtüren: Nadelholz  [ND: 35]",334,115,"Standardtüren: Nadelholz",35]
["334-121: Brandschutztüren  [ND: 50]",334,121,"Brandschutztüren",50]
["334-131: Sondertüren: Schallschutztüren, Glastüren  [ND: 50]",334,131,"Sondertüren: Schallschutztüren, Glastüren",50]
["334-132: Sondertüren: Automatiktüren  [ND: 20]",334,132,"Sondertüren: Automatiktüren",20]
["334-133: Sondertüren: Schiebetüren, Rotationstüren  [ND: 30]",334,133,"Sondertüren: Schiebetüren, Rotationstüren",30]
["334-211: Fenster (Rahmen und Flügel): Aluminium, Aluminium-Holz-Komposit, Aluminium-Kunststoff-Komposit, Laubholz behandelt, Stahl  [ND: 50]",334,211,"Fenster (Rahmen und Flügel): Aluminium, Aluminium-Holz-Komposit, Aluminium-Kunststoff-Komposit, Laubholz behandelt, Stahl",50]
["334-212: Fenster (Rahmen und Flügel): Kunststoff, Nadelholz behandelt  [ND: 40]",334,212,"Fenster (Rahmen und Flügel): Kunststoff, Nadelholz behandelt",40]
["334-311: Beschläge: einfache Beschläge, Schiebebeschläge  [ND: 30]",334,311,"Beschläge: einfache Beschläge, Schiebebeschläge",30]
["334-312: Beschläge: Drehkippbeschläge, Schwingflügelbeschläge, Hebedrehkippbeschläge  [ND: 25]",334,312,"Beschläge: Drehkippbeschläge, Schwingflügelbeschläge, Hebedrehkippbeschläge",25]
["334-313: Türschlösser, Türanschlagdämpfer, Panikverschlüsse  [ND: 25]",334,313,"Türschlösser, Türanschlagdämpfer, Panikverschlüsse",25]
["334-314: Türschließer  [ND: 20]",334,314,"Türschließer",20]
["334-315: Türantriebe  [ND: 15]",334,315,"Türantriebe",15]
["334-316: Verglasung: Sicherheits-Isolierglas, 3-Scheiben-Wärmeschutz-Isolierglas, 2-Scheiben-Wärmeschutz-Isolierglas, Brandschutz-Isolierglas, Schallschutz-Isolierglas, Angriffhemmendes Isolierglas, Sonnenschutz-Isolierglas  [ND: 30]",334,316,"Verglasung: Sicherheits-Isolierglas, 3-Scheiben-Wärmeschutz-Isolierglas, 2-Scheiben-Wärmeschutz-Isolierglas, Brandschutz-Isolierglas, Schallschutz-Isolierglas, Angriffhemmendes Isolierglas, Sonnenschutz-Isolierglas",30]
["334-317: Dichtungsprofile  [ND: 20]",334,317,"Dichtungsprofile",20]
["334-318: Dichtungsstoffe  [ND: 12]",334,318,"Dichtungsstoffe",12]
["334-319: Rolläden  [ND: 40]",334,319,"Rolläden",40]
["335-111: Abdichtungen erdberührt, gegen drückendes Wasser: Dichtungsbahnen  [ND: 50]",335,111,"Abdichtungen erdberührt, gegen drückendes Wasser: Dichtungsbahnen",50]
["335-112: Abdichtungen erdberührt, gegen drückendes Wasser: Bentonit  [ND: 40]",335,112,"Abdichtungen erdberührt, gegen drückendes Wasser: Bentonit",40]
["335-113: Abdichtungen erdberührt: Konstruktionen aus wasserundurchlässigem Beton  [ND: 50]",335,113,"Abdichtungen erdberührt: Konstruktionen aus wasserundurchlässigem Beton",50]
["335-121: Abdichtungen erdberührt, gegen nichtdrückendes Wasser: Dichtungsbahnen aus Bitumen, Spachtelmasse  [ND: 40]",335,121,"Abdichtungen erdberührt, gegen nichtdrückendes Wasser: Dichtungsbahnen aus Bitumen, Spachtelmasse",40]
["335-122: Abdichtungen erdberührt, gegen nichtdrückendes Wasser: Beschichtungen und Anstriche  [ND: 30]",335,122,"Abdichtungen erdberührt, gegen nichtdrückendes Wasser: Beschichtungen und Anstriche",30]
["335-131: Abdichtungen erdberührt nachträglich: Querschnittsabdichtungen gegen aufsteigende Feuchtigkeit durch mechanische Injektion  [ND: 40]",335,131,"Abdichtungen erdberührt nachträglich: Querschnittsabdichtungen gegen aufsteigende Feuchtigkeit durch mechanische Injektion",40]
["335-132: Abdichtungen erdberührt nachträglich: Vergelung, Schleierinjektion  [ND: 20]",335,132,"Abdichtungen erdberührt nachträglich: Vergelung, Schleierinjektion",20]
["335-141: Abdichtungen erdberührt: Abdichtungsschutz aus Schutzmauern (Beton, Ziegel, Hartbrandklinker)  [ND: 50]",335,141,"Abdichtungen erdberührt: Abdichtungsschutz aus Schutzmauern (Beton, Ziegel, Hartbrandklinker)",50]
["335-142: Abdichtungen erdberührt: Abdichtungsschutz aus Hartschaumplatten Polystyrol, Noppenbahnen (Polyethylen Polypropylen), Wellplatten faserverstärkt auf Zementbasis  [ND: 40]",335,142,"Abdichtungen erdberührt: Abdichtungsschutz aus Hartschaumplatten Polystyrol, Noppenbahnen (Polyethylen Polypropylen), Wellplatten faserverstärkt auf Zementbasis",40]
["335-143: Abdichtungen erdberührt: Abdichtungsschutz aus Granulatmatten, Wellplatten  [ND: 30]",335,143,"Abdichtungen erdberührt: Abdichtungsschutz aus Granulatmatten, Wellplatten",30]
["335-151: Wärmedämmung erdberührter Bauteile: Perimenterdämmung Schaumglas  [ND: 50]",335,151,"Wärmedämmung erdberührter Bauteile: Perimenterdämmung Schaumglas",50]
["335-152: Wärmedämmung erdberührter Bauteile: Perimenterdämmung Extrudiertes Polystyrol  [ND: 40]",335,152,"Wärmedämmung erdberührter Bauteile: Perimenterdämmung Extrudiertes Polystyrol",40]
["335-211: Außenanstriche, mineralischer Untergrund: Dipersionsfarbe, Dispersions-Silikatfarbe, Weißzementfarbe, Kunststoffbeschichtungen auf Beton, Silikonharzfarbe, Silikatfarbe, Polymerisatharzfarbe  [ND: 15]",335,211,"Außenanstriche, mineralischer Untergrund: Dipersionsfarbe, Dispersions-Silikatfarbe, Weißzementfarbe, Kunststoffbeschichtungen auf Beton, Silikonharzfarbe, Silikatfarbe, Polymerisatharzfarbe",15]
["335-214: Außenanstriche, mineralischer Untergrund: Kalkfarbe  [ND: 8]",335,214,"Außenanstriche, mineralischer Untergrund: Kalkfarbe",8]
["335-215: Außenanstriche, mineralischer Untergrund: Imprägnierung auf Mauerwerk  [ND: 15]",335,215,"Außenanstriche, mineralischer Untergrund: Imprägnierung auf Mauerwerk",15]
["335-216: Außenanstriche, mineralischer Untergrund: Lasur  [ND: 15]",335,216,"Außenanstriche, mineralischer Untergrund: Lasur",15]
["335-221: Holzschutzanstriche, außen: Holzlacke  [ND: 8]",335,221,"Holzschutzanstriche, außen: Holzlacke",8]
["335-222: Holzschutzanstriche, außen: Holzlasuren  [ND: 4]",335,222,"Holzschutzanstriche, außen: Holzlasuren",4]
["335-223: Holzschutzanstriche, außen: Holzöle/ -wachse  [ND: 2]",335,223,"Holzschutzanstriche, außen: Holzöle/ -wachse",2]
["335-231: Graffity-Schutz: kurzfristige wirksame Podukte (auf Zuckerbasis)  [ND: 1]",335,231,"Graffity-Schutz: kurzfristige wirksame Podukte (auf Zuckerbasis)",1]
["335-232: Graffity-Schutz: semipermanente Systeme (Hydrophobierung mit \"Opferschicht\")  [ND: 10]",335,232,"Graffity-Schutz: semipermanente Systeme (Hydrophobierung mit \"Opferschicht\")",10]
["335-233: Graffity-Schutz: permanente Systeme (dickschichtig)  [ND: 20]",335,233,"Graffity-Schutz: permanente Systeme (dickschichtig)",20]
["335-311: Putz auf monolitischer Tragschicht: hochhydraulischer Kalkmörtel, Mörtel mit Putzund Mauerbinder, Kalkzementmörtel, Zementmörtel mit Zusatz von Luftkalk, Zementmörtel, Luftkalk, Hydraulischer Kalkmörtel, Wasserkalkmörtel  [ND: 45]",335,311,"Putz auf monolitischer Tragschicht: hochhydraulischer Kalkmörtel, Mörtel mit Putzund Mauerbinder, Kalkzementmörtel, Zementmörtel mit Zusatz von Luftkalk, Zementmörtel, Luftkalk, Hydraulischer Kalkmörtel, Wasserkalkmörtel",45]
["335-312: Putz auf monolitischer Tragschicht: Sanierputzsysteme, mineralische Leichtputzsysteme auf porosierter Tragschicht  [ND: 40]",335,312,"Putz auf monolitischer Tragschicht: Sanierputzsysteme, mineralische Leichtputzsysteme auf porosierter Tragschicht",40]
["335-313: Putz auf monolitischer Tragschicht: Silikatputze, Silikonharzputze, Kunstharzputze  [ND: 30]",335,313,"Putz auf monolitischer Tragschicht: Silikatputze, Silikonharzputze, Kunstharzputze",30]
["335-314: Putz auf Wärmedämmung: mineralische Putzsysteme, silikatische Putzsysteme, Kunstharzputzsysteme, Silikonharzputzsysteme  [ND: 30]",335,314,"Putz auf Wärmedämmung: mineralische Putzsysteme, silikatische Putzsysteme, Kunstharzputzsysteme, Silikonharzputzsysteme",30]
["335-411: Bekleidungen: Klinker, Kalksandstein, Sichtbeton  [ND: 50]",335,411,"Bekleidungen: Klinker, Kalksandstein, Sichtbeton",50]
["335-511: Bekleidungen: Naturstein, Kunststein, Betonsteinplatten, Faserzementplatten, Kunstharzstein, Ziegelplatten, keramische Fliesen und Platten, Feinsteinzeug, Steinzeug und Steinplatten  [ND: 50]",335,511,"Bekleidungen: Naturstein, Kunststein, Betonsteinplatten, Faserzementplatten, Kunstharzstein, Ziegelplatten, keramische Fliesen und Platten, Feinsteinzeug, Steinzeug und Steinplatten",50]
["335-521: keramische Fliesen und Platten: Fliesenverfugungsmassen  [ND: 30]",335,521,"keramische Fliesen und Platten: Fliesenverfugungsmassen",30]
["335-522: Bekleidungen keramisch auf Wärmedämmung: Fliesen, Klinkerriemchen  [ND: 30]",335,522,"Bekleidungen keramisch auf Wärmedämmung: Fliesen, Klinkerriemchen",30]
["335-611: Dämmschicht als Kerndämmung: Glaswolledämmplatten, Steinwollewdämmplatten, Polyurethandämmplatten, Polystyrol, Blähschiefergranulat, Blähglasgranulat, Blähtongranulat  [ND: 50]",335,611,"Dämmschicht als Kerndämmung: Glaswolledämmplatten, Steinwollewdämmplatten, Polyurethandämmplatten, Polystyrol, Blähschiefergranulat, Blähglasgranulat, Blähtongranulat",50]
["335-621: Dämmschicht hinter Vorsatzschale, hinterlüftet: Mineralschaumplatten, Schaumglasplatten  [ND: 50]",335,621,"Dämmschicht hinter Vorsatzschale, hinterlüftet: Mineralschaumplatten, Schaumglasplatten",50]
["335-631: Dämmschicht hinter Vorsatzschale: Vakuumdämmpaneele  [ND: 30]",335,631,"Dämmschicht hinter Vorsatzschale: Vakuumdämmpaneele",30]
["335-641: Wärmedämmverbundsystem: Steinwolledämmplatten, Mineralwolledämmplatten, Polystyroldämmplatten, Polyurethandämmplatten, Holzfaserdämmplatten, Holzwolleleichtbauplatten, Korkplatten  [ND: 40]",335,641,"Wärmedämmverbundsystem: Steinwolledämmplatten, Mineralwolledämmplatten, Polystyroldämmplatten, Polyurethandämmplatten, Holzfaserdämmplatten, Holzwolleleichtbauplatten, Korkplatten",40]
["335-642: Wärmedämmverbundsystem, transparent  [ND: 20]",335,642,"Wärmedämmverbundsystem, transparent",20]
["335-711: Holzbekleidungen: Nadelholz behandelt, Laubholz, Holzwerkstoff-Systeme  [ND: 40]",335,711,"Holzbekleidungen: Nadelholz behandelt, Laubholz, Holzwerkstoff-Systeme",40]
["335-712: Holzbekleidung: Nadelholz unbehandelt  [ND: 30]",335,712,"Holzbekleidung: Nadelholz unbehandelt",30]
["335-713: Holzbekleidung: Holzschindeln  [ND: 50]",335,713,"Holzbekleidung: Holzschindeln",50]
["335-811: Metallbekleidungen: Zink, Kupfer, Aluminium eloxiert, Aluminium lackiert, Stahl nicht rostend  [ND: 50]",335,811,"Metallbekleidungen: Zink, Kupfer, Aluminium eloxiert, Aluminium lackiert, Stahl nicht rostend",50]
["335-812: Metallbekleidungen: Stahl galvanisch verzinkt  [ND: 40]",335,812,"Metallbekleidungen: Stahl galvanisch verzinkt",40]
["335-813: Vorsatzschale, hinterlüftet: Kupferblech  [ND: 50]",335,813,"Vorsatzschale, hinterlüftet: Kupferblech",50]
["335-814: Vorsatzschale, hinterlüftet: Zink, Stahl nicht rostend  [ND: 45]",335,814,"Vorsatzschale, hinterlüftet: Zink, Stahl nicht rostend",45]
["335-815: Vorsatzschale, hinterlüftet: korrosionsreduzierter Stahl, Stahl galvanisch verzinkt und beschichtet  [ND: 30]",335,815,"Vorsatzschale, hinterlüftet: korrosionsreduzierter Stahl, Stahl galvanisch verzinkt und beschichtet",30]
["335-816: Vorsatzschale hinterlüftet: Aluminium-Verbundplatten  [ND: 50]",335,816,"Vorsatzschale hinterlüftet: Aluminium-Verbundplatten",50]
["335-911: Vorsatzschale, hinterlüftet: Glas  [ND: 50]",335,911,"Vorsatzschale, hinterlüftet: Glas",50]
["335-912: Kunststoffstegplatten, transparent: Acrylglasplatten  [ND: 40]",335,912,"Kunststoffstegplatten, transparent: Acrylglasplatten",40]
["335-913: Kunststoffstegplatten, transparent: Polycarbonatplatten  [ND: 30]",335,913,"Kunststoffstegplatten, transparent: Polycarbonatplatten",30]
["335-914: Vorsatzschale, hinterlüftet: faserverstärkte Harzkompositplatten  [ND: 30]",335,914,"Vorsatzschale, hinterlüftet: faserverstärkte Harzkompositplatten",30]
["335-915: Wandbekleidungen (Systeme): Kunststoff, Mehrschichtleichtbauplatten  [ND: 40]",335,915,"Wandbekleidungen (Systeme): Kunststoff, Mehrschichtleichtbauplatten",40]
["335-916: Vorsatzschale: Fugen und Kompriband, Verfugung, Dehnungsfuge, Profil  [ND: 40]",335,916,"Vorsatzschale: Fugen und Kompriband, Verfugung, Dehnungsfuge, Profil",40]
["335-917: Vorsatzschale: Unterkonstruktion  [ND: 50]",335,917,"Vorsatzschale: Unterkonstruktion",50]
["336-111: Bekleidung Dämmplatten: Mineralschaumdämmplatten, Calciumsilikatplatten  [ND: 50]",336,111,"Bekleidung Dämmplatten: Mineralschaumdämmplatten, Calciumsilikatplatten",50]
["338-111: Jalousien: Kunststoff, Aluminium  [ND: 25]",338,111,"Jalousien: Kunststoff, Aluminium",25]
["338-211: Markisen  [ND: 15]",338,211,"Markisen",15]
["338-311: Sonnenschutz, feststehend: Aluminium  [ND: 50]",338,311,"Sonnenschutz, feststehend: Aluminium",50]
["339-111: frei stehende Konstruktion: Mauerwerk, Stahlbeton, Stahl nicht rostend, Stahl feuerverzinkt (stückverzinkt), Aluminium beschichtet, Laubholz, Kunststoff-Komposit  [ND: 50]",339,111,"frei stehende Konstruktion: Mauerwerk, Stahlbeton, Stahl nicht rostend, Stahl feuerverzinkt (stückverzinkt), Aluminium beschichtet, Laubholz, Kunststoff-Komposit",50]
["339-112: frei stehende Konstruktion: Nadelholz, behandelt  [ND: 45]",339,112,"frei stehende Konstruktion: Nadelholz, behandelt",45]
["339-121: Brüstung: Stahlgitterkonstruktion feuerverzinkt (stückverzinkt), Glas, Mauerwerk, Stahlbeton  [ND: 50]",339,121,"Brüstung: Stahlgitterkonstruktion feuerverzinkt (stückverzinkt), Glas, Mauerwerk, Stahlbeton",50]
["339-122: Brüstung aus Holzkonstruktion  [ND: 30]",339,122,"Brüstung aus Holzkonstruktion",30]
["339-123: Brüstungsbekleidung aus Aluminiumplatten, Glasplatten  [ND: 50]",339,123,"Brüstungsbekleidung aus Aluminiumplatten, Glasplatten",50]
["339-124: Brüstungsbekleidung aus Kunststoffplatten  [ND: 40]",339,124,"Brüstungsbekleidung aus Kunststoffplatten",40]
["341-111: Mauerwerkswand  [ND: 50]",341,111,"Mauerwerkswand",50]
["341-211: Betonwand  [ND: 50]",341,211,"Betonwand",50]
["341-311: Holzwand  [ND: 50]",341,311,"Holzwand",50]
["342-111: Mauerwerkswand  [ND: 50]",342,111,"Mauerwerkswand",50]
["342-211: Betonwand  [ND: 50]",342,211,"Betonwand",50]
["342-311: Holzwand  [ND: 50]",342,311,"Holzwand",50]
["342-411: Ständersysteme  [ND: 50]",342,411,"Ständersysteme",50]
["342-511: Gipswandbauplatten  [ND: 50]",342,511,"Gipswandbauplatten",50]
["343-111: Mauerwerksstütze  [ND: 50]",343,111,"Mauerwerksstütze",50]
["343-211: Betonstütze  [ND: 50]",343,211,"Betonstütze",50]
["343-311: Holzstütze  [ND: 50]",343,311,"Holzstütze",50]
["343-411: Stahlstütze  [ND: 50]",343,411,"Stahlstütze",50]
["344-111: Standardtüren: Holztüren, Holzwerkstofftüren, Aluminiumtüren, Kunststofftüren, Stahltüren und Stahltüren rostfrei  [ND: 50]",344,111,"Standardtüren: Holztüren, Holzwerkstofftüren, Aluminiumtüren, Kunststofftüren, Stahltüren und Stahltüren rostfrei",50]
["344-211: Sondertüren: Glastüren, Rauchschutztüren, Schallschutztüren  [ND: 50]",344,211,"Sondertüren: Glastüren, Rauchschutztüren, Schallschutztüren",50]
["344-311: Brandschutztüren  [ND: 50]",344,311,"Brandschutztüren",50]
["344-312: Sondertüren: Feuchtraumtüren  [ND: 40]",344,312,"Sondertüren: Feuchtraumtüren",40]
["344-313: Sondertüren: Schiebetüren, Rotationstüren  [ND: 30]",344,313,"Sondertüren: Schiebetüren, Rotationstüren",30]
["344-314: Sondertüren: Automatiktüren  [ND: 20]",344,314,"Sondertüren: Automatiktüren",20]
["344-411: Tore: Brandschutztore  [ND: 30]",344,411,"Tore: Brandschutztore",30]
["344-511: Fenster (Rahmen und Flügel)  [ND: 50]",344,511,"Fenster (Rahmen und Flügel)",50]
["344-611: Beschläge: einfache Beschläge  [ND: 50]",344,611,"Beschläge: einfache Beschläge",50]
["344-612: Beschläge: Schwingflügelbeschläge, Falttürbeschläge, Schiebebeschläge, Drehkippbeschläge, Hebedrehkippbeschläge  [ND: 30]",344,612,"Beschläge: Schwingflügelbeschläge, Falttürbeschläge, Schiebebeschläge, Drehkippbeschläge, Hebedrehkippbeschläge",30]
["344-613: Türschließer, Türschlösser, Fensterschlösser  [ND: 30]",344,613,"Türschließer, Türschlösser, Fensterschlösser",30]
["344-614: Panikverschlüsse  [ND: 25]",344,614,"Panikverschlüsse",25]
["344-615: Türantriebe  [ND: 15]",344,615,"Türantriebe",15]
["344-616: Türanschlagdämpfer  [ND: 20]",344,616,"Türanschlagdämpfer",20]
["344-617: Fenster und Türverglasung: Einfachverglasung  [ND: 50]",344,617,"Fenster und Türverglasung: Einfachverglasung",50]
["344-618: Fenster und Türverglasung: angriffhemmendes Isolierglas, Sicherheits-Isolierglas, Brandschutz-Isolierglas, Schallschutz-Isolierglas  [ND: 40]",344,618,"Fenster und Türverglasung: angriffhemmendes Isolierglas, Sicherheits-Isolierglas, Brandschutz-Isolierglas, Schallschutz-Isolierglas",40]
["344-621: Dichtungsprofile  [ND: 30]",344,621,"Dichtungsprofile",30]
["344-622: Dichtungsstoffe  [ND: 20]",344,622,"Dichtungsstoffe",20]
["345-111: Innenanstriche: Nassabriebklasse 1  [ND: 15]",345,111,"Innenanstriche: Nassabriebklasse 1",15]
["345-112: Innenanstriche: Nassabriebklasse 2  [ND: 10]",345,112,"Innenanstriche: Nassabriebklasse 2",10]
["345-113: Innenanstriche: Nassabriebklasse 3  [ND: 5]",345,113,"Innenanstriche: Nassabriebklasse 3",5]
["345-114: Innenanstriche: Lasur  [ND: 18]",345,114,"Innenanstriche: Lasur",18]
["345-211: Standard-Innenputze: Gipsputz, Anhydritputz, Kalkputz, Kalkgipsputz, Kalkzementputz, Kunstharzputz, Lehmputz  [ND: 50]",345,211,"Standard-Innenputze: Gipsputz, Anhydritputz, Kalkputz, Kalkgipsputz, Kalkzementputz, Kunstharzputz, Lehmputz",50]
["345-212: mineralische Deckputze: Zementputz, Trasskalkputz, Trasszementputz  [ND: 50]",345,212,"mineralische Deckputze: Zementputz, Trasskalkputz, Trasszementputz",50]
["345-213: Spezialputze: Sanierputz/-System  [ND: 15]",345,213,"Spezialputze: Sanierputz/-System",15]
["345-214: Spezialputze: Akustikputz, Strahlenschutzputz  [ND: 50]",345,214,"Spezialputze: Akustikputz, Strahlenschutzputz",50]
["345-221: Putzprofile: Kunststoff, Stahl, Glasfaser  [ND: 50]",345,221,"Putzprofile: Kunststoff, Stahl, Glasfaser",50]
["345-222: Putzträger: Stahldrahtnetz, Rippenstreckmetall, Kunststoffgewebe  [ND: 50]",345,222,"Putzträger: Stahldrahtnetz, Rippenstreckmetall, Kunststoffgewebe",50]
["345-311: Bekleidungen: Holz, Holzwerkstoffe und Mehrschichtleichtbauplatten, Aluminium, Stahl, Kupfer, Zink, Bekleidungen: Naturstein, Kunststein, keramische Fliesen und Platten, Feinsteinzeug  [ND: 50]",345,311,"Bekleidungen: Holz, Holzwerkstoffe und Mehrschichtleichtbauplatten, Aluminium, Stahl, Kupfer, Zink, Bekleidungen: Naturstein, Kunststein, keramische Fliesen und Platten, Feinsteinzeug",50]
["345-313: Bekleidungen (Systeme): Gipskartonplatten, Gipskartonverbundplatten  [ND: 50]",345,313,"Bekleidungen (Systeme): Gipskartonplatten, Gipskartonverbundplatten",50]
["345-314: Bekleidungen: Kunststoff (PVC, PE. PP)  [ND: 40]",345,314,"Bekleidungen: Kunststoff (PVC, PE. PP)",40]
["345-315: Bekleidungen: Sonderkonstruktionen aus Glas  [ND: 50]",345,315,"Bekleidungen: Sonderkonstruktionen aus Glas",50]
["345-316: Spezial-Bekleidungen: Brandschutz, Schallschutz, feuerressistente Bekleidungen  [ND: 50]",345,316,"Spezial-Bekleidungen: Brandschutz, Schallschutz, feuerressistente Bekleidungen",50]
["345-411: Tapeten: Papier, Kunststoff, Tapeten nicht überstreichbar, Tapeten überstreichbar  [ND: 10]",345,411,"Tapeten: Papier, Kunststoff, Tapeten nicht überstreichbar, Tapeten überstreichbar",10]
["345-412: Tapeten: Textil, Webstoff  [ND: 15]",345,412,"Tapeten: Textil, Webstoff",15]
["346-111: Sanitärtrennwände: Toilettentrennwände, Urinaltrennwände  [ND: 30]",346,111,"Sanitärtrennwände: Toilettentrennwände, Urinaltrennwände",30]
["346-112: Sanitärtrennwände: Duschtrennwände  [ND: 25]",346,112,"Sanitärtrennwände: Duschtrennwände",25]
["346-211: Umkleidekabinen  [ND: 30]",346,211,"Umkleidekabinen",30]
["349-111: Treppengeländer: Handläufe aus Aluminium, Laubholz, Stahl  [ND: 50]",349,111,"Treppengeländer: Handläufe aus Aluminium, Laubholz, Stahl",50]
["349-112: Treppengeländer: Handläufe aus Kunststoff, Nadelholz  [ND: 30]",349,112,"Treppengeländer: Handläufe aus Kunststoff, Nadelholz",30]
["351-111: Betondecken: Vollbetondecke, STB-Hohlraumdecke, Porenbetondecke  [ND: 50]",351,111,"Betondecken: Vollbetondecke, STB-Hohlraumdecke, Porenbetondecke",50]
["351-211: Fertigteildecken: Gitterträgerdecke, Rippendecke  [ND: 50]",351,211,"Fertigteildecken: Gitterträgerdecke, Rippendecke",50]
["351-311: Metalldecken: Stahlverbunddecke, Stahlträgerdecke  [ND: 50]",351,311,"Metalldecken: Stahlverbunddecke, Stahlträgerdecke",50]
["351-411: Holzdecken: Massivholzdecke, Holzbalkendecke, Holz-Fertigteilelemente, Holz-Beton-Verbunddecke  [ND: 50]",351,411,"Holzdecken: Massivholzdecke, Holzbalkendecke, Holz-Fertigteilelemente, Holz-Beton-Verbunddecke",50]
["351-511: Treppe: Tragkonstruktion aus Stahlbeton, Stahl, Holz, Aluminium  [ND: 50]",351,511,"Treppe: Tragkonstruktion aus Stahlbeton, Stahl, Holz, Aluminium",50]
["352-111: Fließestriche: Zementestrich, Gussasphaltestrich, Anhydritestrich, Magnesiaestrich  [ND: 50]",352,111,"Fließestriche: Zementestrich, Gussasphaltestrich, Anhydritestrich, Magnesiaestrich",50]
["352-112: Trockenestriche (Systeme): Holzwerkstoffplatten, Gipsfaserplatten, Gipskartonplatten  [ND: 50]",352,112,"Trockenestriche (Systeme): Holzwerkstoffplatten, Gipsfaserplatten, Gipskartonplatten",50]
["352-113: Estrische als Verschleißboden  [ND: 50]",352,113,"Estrische als Verschleißboden",50]
["352-121: Trittschalldämmung  [ND: 50]",352,121,"Trittschalldämmung",50]
["352-122: Fußbodendämmung, einschl. Dämmung der obersten Geschossdecke  [ND: 50]",352,122,"Fußbodendämmung, einschl. Dämmung der obersten Geschossdecke",50]
["352-211: Natursteinbeläge  [ND: 50]",352,211,"Natursteinbeläge",50]
["352-311: Kunststeinbeläge  [ND: 50]",352,311,"Kunststeinbeläge",50]
["352-411: keramische Fliesen und Platten: Feinsteinzeug, Steinzeug, Steingut Spaltplatten, Glasmosaik  [ND: 50]",352,411,"keramische Fliesen und Platten: Feinsteinzeug, Steinzeug, Steingut Spaltplatten, Glasmosaik",50]
["352-511: Gussböden: Kunstharz  [ND: 30]",352,511,"Gussböden: Kunstharz",30]
["352-512: Gussböden: Terrazzo  [ND: 50]",352,512,"Gussböden: Terrazzo",50]
["352-611: textile Beläge: Baumwolle, Wolle, Synthetikfaser, Sisal, Naturfasergemisch, Jute, Kokos  [ND: 10]",352,611,"textile Beläge: Baumwolle, Wolle, Synthetikfaser, Sisal, Naturfasergemisch, Jute, Kokos",10]
["352-711: Linoleum, Laminat, PVC, Kunststoff-Parkett, Kork, Kautschuk, Sporthallenbeläge  [ND: 20]",352,711,"Linoleum, Laminat, PVC, Kunststoff-Parkett, Kork, Kautschuk, Sporthallenbeläge",20]
["352-811: Vollholzparkett, Holzdielen, Holzpflaster  [ND: 50]",352,811,"Vollholzparkett, Holzdielen, Holzpflaster",50]
["352-812: Holz-Mehrschichtparkett  [ND: 40]",352,812,"Holz-Mehrschichtparkett",40]
["352-813: Holzbeschichtung für Bodenbeläge: Holzlacke, Holzversiegelungen  [ND: 15]",352,813,"Holzbeschichtung für Bodenbeläge: Holzlacke, Holzversiegelungen",15]
["352-815: Holzschutzanstriche für Bodenbeläge: Holzöle/-wachse  [ND: 4]",352,815,"Holzschutzanstriche für Bodenbeläge: Holzöle/-wachse",4]
["352-911: Doppelböden und Hohlraumböden  [ND: 50]",352,911,"Doppelböden und Hohlraumböden",50]
["352-912: Doppelbodenstützen und Hohlraumbodenstützen: Stahl  [ND: 50]",352,912,"Doppelbodenstützen und Hohlraumbodenstützen: Stahl",50]
["352-921: Schwingböden: Holz, Kunststoff  [ND: 45]",352,921,"Schwingböden: Holz, Kunststoff",45]
["352-931: Sockelleisten: Naturstein, Kunststein, Klinker, Keramik, Holz  [ND: 50]",352,931,"Sockelleisten: Naturstein, Kunststein, Klinker, Keramik, Holz",50]
["352-941: Schmutzfangbeläge: Synthetikfaser, Kunststoff, Baumwolle, Sisal, Jute, Kokos  [ND: 8]",352,941,"Schmutzfangbeläge: Synthetikfaser, Kunststoff, Baumwolle, Sisal, Jute, Kokos",8]
["352-951: Oberflächenbehandlung: Versiegelung  [ND: 12]",352,951,"Oberflächenbehandlung: Versiegelung",12]
["352-952: Oberflächenbehandlung: Beschichtung auf Kunststoffbasis  [ND: 10]",352,952,"Oberflächenbehandlung: Beschichtung auf Kunststoffbasis",10]
["352-953: Oberflächenbehandlung: Beschichtung auf Wachsoder Ölbasis  [ND: 8]",352,953,"Oberflächenbehandlung: Beschichtung auf Wachsoder Ölbasis",8]
["353-111: Gipskartonbekleidungen  [ND: 50]",353,111,"Gipskartonbekleidungen",50]
["353-211: Metallbekeidungen: Aluminium, Stahl, Kupfer, Zink  [ND: 50]",353,211,"Metallbekeidungen: Aluminium, Stahl, Kupfer, Zink",50]
["353-311: Holzbekleidungen: Holz, Holzwerkstoffe und Mehrschichtleichtbauplatten  [ND: 50]",353,311,"Holzbekleidungen: Holz, Holzwerkstoffe und Mehrschichtleichtbauplatten",50]
["353-411: Sonderkonstruktionen inkl. Befestigung: Mineralfaserplatten, Kunststoffplatten, Glasplatten  [ND: 50]",353,411,"Sonderkonstruktionen inkl. Befestigung: Mineralfaserplatten, Kunststoffplatten, Glasplatten",50]
["353-412: Sonderkonstruktionen inkl. Befestigung: Brandschutz-Unterdecken  [ND: 40]",353,412,"Sonderkonstruktionen inkl. Befestigung: Brandschutz-Unterdecken",40]
["353-413: Sonderkonstruktionen inkl. Befestigung: Akustikdecken, Akustikelemente, Akustikschaum, Schallabsorber  [ND: 40]",353,413,"Sonderkonstruktionen inkl. Befestigung: Akustikdecken, Akustikelemente, Akustikschaum, Schallabsorber",40]
["353-414: Sonderkonstruktionen inkl. Befestigung: Lichtdecken  [ND: 25]",353,414,"Sonderkonstruktionen inkl. Befestigung: Lichtdecken",25]
["353-421: Dämmung der Kellerdecke  [ND: 50]",353,421,"Dämmung der Kellerdecke",50]
["353-511: Tapeten: überstreichbar  [ND: 20]",353,511,"Tapeten: überstreichbar",20]
["353-512: Tapeten: Kunststoff, Texil, Webstoff, Papier nicht überstreichbar  [ND: 10]",353,512,"Tapeten: Kunststoff, Texil, Webstoff, Papier nicht überstreichbar",10]
["353-611: Unterkonstruktionen: Trockenbauprofile (Stahl, Holz)  [ND: 50]",353,611,"Unterkonstruktionen: Trockenbauprofile (Stahl, Holz)",50]
["353-711: Innensnstriche: Nassabriebsklasse 1  [ND: 15]",353,711,"Innensnstriche: Nassabriebsklasse 1",15]
["353-712: Innensnstriche: Nassabriebsklasse 2  [ND: 10]",353,712,"Innensnstriche: Nassabriebsklasse 2",10]
["353-713: Innensnstriche: Nassabriebsklasse 3  [ND: 5]",353,713,"Innensnstriche: Nassabriebsklasse 3",5]
["353-714: Innensnstriche: Holzlasur  [ND: 18]",353,714,"Innensnstriche: Holzlasur",18]
["359-111: Geländer, Gitter, Roste, Leitern: Stahl, Aluminium, Holz, Holzwerkstoff, Gusseisen  [ND: 50]",359,111,"Geländer, Gitter, Roste, Leitern: Stahl, Aluminium, Holz, Holzwerkstoff, Gusseisen",50]
["359-112: Gitter und Roste: Kunststoff  [ND: 40]",359,112,"Gitter und Roste: Kunststoff",40]
["361-111: Tragkonstruktion: Schrägdach  [ND: 50]",361,111,"Tragkonstruktion: Schrägdach",50]
["361-211: Tragkonstruktion: Flachdach  [ND: 50]",361,211,"Tragkonstruktion: Flachdach",50]
["362-111: Dachflächenfenster (Rahmen): Aluminium, Kunststoff, Aluminium-Holz-Komposit  [ND: 50]",362,111,"Dachflächenfenster (Rahmen): Aluminium, Kunststoff, Aluminium-Holz-Komposit",50]
["362-112: Dachflächenfenster (Rahmen): Aluminium-Kunststoff-Komposit  [ND: 35]",362,112,"Dachflächenfenster (Rahmen): Aluminium-Kunststoff-Komposit",35]
["362-113: Dachflächenfenster (Rahmen): Laubholz, behandelt  [ND: 40]",362,113,"Dachflächenfenster (Rahmen): Laubholz, behandelt",40]
["362-114: Dachflächenfenster (Rahmen): Nadelholz, behandelt  [ND: 25]",362,114,"Dachflächenfenster (Rahmen): Nadelholz, behandelt",25]
["362-211: Lichtkuppeln  [ND: 25]",362,211,"Lichtkuppeln",25]
["362-221: Lichtbänder  [ND: 20]",362,221,"Lichtbänder",20]
["362-311: Dachausstiege und Luken: Stahl feuerverzinkt (stückverzinkt)  [ND: 40]",362,311,"Dachausstiege und Luken: Stahl feuerverzinkt (stückverzinkt)",40]
["362-312: Dachausstiege und Luken: Kunststoff  [ND: 30]",362,312,"Dachausstiege und Luken: Kunststoff",30]
["362-411: Antriebe für Öffnungen: Handantrieb  [ND: 35]",362,411,"Antriebe für Öffnungen: Handantrieb",35]
["362-412: Antriebe für Öffnungen: elektrischer Antrieb  [ND: 25]",362,412,"Antriebe für Öffnungen: elektrischer Antrieb",25]
["362-413: Antriebe für Öffnungen: pneumatischer Antrieb  [ND: 20]",362,413,"Antriebe für Öffnungen: pneumatischer Antrieb",20]
["363-111: Abdichtungsbahnen: Elastomerbahnen, Kunststoffbahnen unterhalb der Dämmung   [ND: 40]",363,111,"Abdichtungsbahnen: Elastomerbahnen, Kunststoffbahnen unterhalb der Dämmung ",40]
["363-112: Abdichtungsbahnen: Bitumenbahnen unterhalb der Dämmung   [ND: 30]",363,112,"Abdichtungsbahnen: Bitumenbahnen unterhalb der Dämmung ",30]
["363-113: Abdichtungsbahnen: Bitumenbahnen, Elastomerbahnen, Kunststoffbahnen oberhalb Dämmung mit schwerer Schutzschicht   [ND: 30]",363,113,"Abdichtungsbahnen: Bitumenbahnen, Elastomerbahnen, Kunststoffbahnen oberhalb Dämmung mit schwerer Schutzschicht ",30]
["363-114: Abdichtungsbahnen: Bitumenbahnen, Elastomerbahnen, Kunststoffbahnen oberhalb Dämmung mit leichter Schutzschicht   [ND: 20]",363,114,"Abdichtungsbahnen: Bitumenbahnen, Elastomerbahnen, Kunststoffbahnen oberhalb Dämmung mit leichter Schutzschicht ",20]
["363-211: Abdichtmassen: Asphaltmastix, Flüssigabdichtung, Gussasphalt unterhalb der Dämmung   [ND: 40]",363,211,"Abdichtmassen: Asphaltmastix, Flüssigabdichtung, Gussasphalt unterhalb der Dämmung ",40]
["363-212: Abdichtmassen: Asphaltmastix, Flüssigabdichtung, Gussasphalt oberhalb Dämmung mit schwerer Schutzschicht   [ND: 30]",363,212,"Abdichtmassen: Asphaltmastix, Flüssigabdichtung, Gussasphalt oberhalb Dämmung mit schwerer Schutzschicht ",30]
["363-213: Abdichtmassen: Asphaltmastix, Flüssigabdichtung, Gussasphalt oberhalb Dämmung mit leichter Schutzschicht   [ND: 20]",363,213,"Abdichtmassen: Asphaltmastix, Flüssigabdichtung, Gussasphalt oberhalb Dämmung mit leichter Schutzschicht ",20]
["363-214: Abdichtmassen: Flüssigabdichtung oberhalb Dämmung ohne Schutzschicht   [ND: 20]",363,214,"Abdichtmassen: Flüssigabdichtung oberhalb Dämmung ohne Schutzschicht ",20]
["363-311: Schwere Schutzschicht: Extensive Begrünung   [ND: 40]",363,311,"Schwere Schutzschicht: Extensive Begrünung ",40]
["363-312: Schwere Schutzschicht: Bekiesung, Verlegeplatten, Intensive Begrünung   [ND: 30]",363,312,"Schwere Schutzschicht: Bekiesung, Verlegeplatten, Intensive Begrünung ",30]
["363-313: Leichte Schutzschicht: Besplitterung vor Ort, werkseitige Bestreuung   [ND: 15]",363,313,"Leichte Schutzschicht: Besplitterung vor Ort, werkseitige Bestreuung ",15]
["363-411: Beschichtungen: Metallanstrich   [ND: 12]",363,411,"Beschichtungen: Metallanstrich ",12]
["363-511: Deckungen: Schiefer  [ND: 50]",363,511,"Deckungen: Schiefer",50]
["363-512: Deckungen: Ziegel  [ND: 50]",363,512,"Deckungen: Ziegel",50]
["363-513: Deckungen: Beton  [ND: 50]",363,513,"Deckungen: Beton",50]
["363-514: Deckungen: Zink, Kupferblech, Stahl nicht rostend  [ND: 50]",363,514,"Deckungen: Zink, Kupferblech, Stahl nicht rostend",50]
["363-515: Deckungen: Holzschindeln  [ND: 50]",363,515,"Deckungen: Holzschindeln",50]
["363-516: Deckungen: Stahl galvanisch verzinkt und beschichtet  [ND: 45]",363,516,"Deckungen: Stahl galvanisch verzinkt und beschichtet",45]
["363-517: Deckungen: Stahl galvanisch verzinkt  [ND: 40]",363,517,"Deckungen: Stahl galvanisch verzinkt",40]
["363-518: Deckungen: Glas   [ND: 30]",363,518,"Deckungen: Glas ",30]
["363-519: Deckungen: Faserzement, Bitumenschindeln, Bitumen-Wellplatten   [ND: 25]",363,519,"Deckungen: Faserzement, Bitumenschindeln, Bitumen-Wellplatten ",25]
["363-521: Metallbanddeckungen: Stahl nicht rostend, Kupfer, Aluminiumblech  [ND: 50]",363,521,"Metallbanddeckungen: Stahl nicht rostend, Kupfer, Aluminiumblech",50]
["363-522: Metallbanddeckungen: Stahlblech galvanisch verzinkt und beschichtet   [ND: 45]",363,522,"Metallbanddeckungen: Stahlblech galvanisch verzinkt und beschichtet ",45]
["363-523: Metallbanddeckungen: galvanisch verzinktes Stahlblech   [ND: 40]",363,523,"Metallbanddeckungen: galvanisch verzinktes Stahlblech ",40]
["363-524: Deckungen: Reet   [ND: 30]",363,524,"Deckungen: Reet ",30]
["363-531: Dämmschicht als Aufund Zwischensparrendämmung: Schaumglasplatten, Steinwollplatten, extrudierte Polystyrolplatten, expandierte Polystyrolplatten, Glaswollplatten, Polyurethanplatten, Faserplatten aus Holz, Hanf, Zellulose  [ND: 50]",363,531,"Dämmschicht als Aufund Zwischensparrendämmung: Schaumglasplatten, Steinwollplatten, extrudierte Polystyrolplatten, expandierte Polystyrolplatten, Glaswollplatten, Polyurethanplatten, Faserplatten aus Holz, Hanf, Zellulose",50]
["363-611: Attikaabdeckungen: Naturstein, Klinker, Fliesen, Keramik, Kunststein, Beton, Betonfertigteil, Kupfer, Aluminium, Stahl nicht rostend, Zink  [ND: 50]",363,611,"Attikaabdeckungen: Naturstein, Klinker, Fliesen, Keramik, Kunststein, Beton, Betonfertigteil, Kupfer, Aluminium, Stahl nicht rostend, Zink",50]
["363-612: Attikaabdeckungen: Faserzement   [ND: 40]",363,612,"Attikaabdeckungen: Faserzement ",40]
["363-613: Attikaabdeckungen: Stahl galvanisch verzinkt   [ND: 30]",363,613,"Attikaabdeckungen: Stahl galvanisch verzinkt ",30]
["363-614: Attikaabdeckungen: Kunststoff   [ND: 20]",363,614,"Attikaabdeckungen: Kunststoff ",20]
["363-711: Entwässerung (Dachrinnen, Regenfallrohre, Dachabläufe): Stahl nicht rostend, Kupfer, Zink, Alu  [ND: 50]",363,711,"Entwässerung (Dachrinnen, Regenfallrohre, Dachabläufe): Stahl nicht rostend, Kupfer, Zink, Alu",50]
["363-712: Entwässerung (Dachrinnen, Regenfallrohre, Dachabläufe): Stahl galvanisch verzinkt und beschichtet   [ND: 40]",363,712,"Entwässerung (Dachrinnen, Regenfallrohre, Dachabläufe): Stahl galvanisch verzinkt und beschichtet ",40]
["363-713: Entwässerung (Dachrinnen, Regenfallrohre, Dachabläufe): Stahl galvanisch verzinkt   [ND: 30]",363,713,"Entwässerung (Dachrinnen, Regenfallrohre, Dachabläufe): Stahl galvanisch verzinkt ",30]
["363-714: Entwässerung (Dachrinnen, Regenfallrohre, Dachabläufe): Kunststoff   [ND: 20]",363,714,"Entwässerung (Dachrinnen, Regenfallrohre, Dachabläufe): Kunststoff ",20]
["364-111: Unterdach: Bitumen-Holzfaserplatten  [ND: 50]",364,111,"Unterdach: Bitumen-Holzfaserplatten",50]
["364-112: Unterdach: Imprägnierte Faserplatten aus Holz, Hanf, Zellulose   [ND: 30]",364,112,"Unterdach: Imprägnierte Faserplatten aus Holz, Hanf, Zellulose ",30]
["364-113: Unterdach: dampfdiffusionsoffene Kunststofffolien   [ND: 30]",364,113,"Unterdach: dampfdiffusionsoffene Kunststofffolien ",30]
["364-211: Zwischen-, Auf- und Untersparrendämmung: Glaswolle, Steinwolle, Holzwolle, Holzwolleleichtbauplatten, Holzfaserdämmplatten, Polystyrol, Polyurethan, Zellulose, Hanf, u.a.  [ND: 50]",364,211,"Zwischen-, Auf- und Untersparrendämmung: Glaswolle, Steinwolle, Holzwolle, Holzwolleleichtbauplatten, Holzfaserdämmplatten, Polystyrol, Polyurethan, Zellulose, Hanf, u.a.",50]
["369-111: Eingangsüberdachung: Stahlbaukonstruktion, Stahl-Glas-Konstruktion, Stahlbetonkonstruktion, Spannbetonkonstruktion, Holzkonstruktion (bekleidet)  [ND: 50]",369,111,"Eingangsüberdachung: Stahlbaukonstruktion, Stahl-Glas-Konstruktion, Stahlbetonkonstruktion, Spannbetonkonstruktion, Holzkonstruktion (bekleidet)",50]
["369-112: Eingangsüberdachung: Holzkonstruktion (unbekleidet), Holz-GlasKonstruktionen, Glaskonstruktion (tragend)   [ND: 40]",369,112,"Eingangsüberdachung: Holzkonstruktion (unbekleidet), Holz-GlasKonstruktionen, Glaskonstruktion (tragend) ",40]
["369-211: Hofüberdachung: Stahl-Glas-Konstruktionen  [ND: 50]",369,211,"Hofüberdachung: Stahl-Glas-Konstruktionen",50]
["369-212: Hofüberdachung: Holz-Glas-Konstruktionen, Seilnetzkonstruktionen   [ND: 40]",369,212,"Hofüberdachung: Holz-Glas-Konstruktionen, Seilnetzkonstruktionen ",40]
["369-213: Hofüberdachung: Textile Konstruktionen   [ND: 8]",369,213,"Hofüberdachung: Textile Konstruktionen ",8]
["369-311: Stahl nicht rostend, Stahl feuerverzinkt (stückverzinkt)  [ND: 50]",369,311,"Stahl nicht rostend, Stahl feuerverzinkt (stückverzinkt)",50]
["369-312: Aluminium, Laubholz behandelt   [ND: 45]",369,312,"Aluminium, Laubholz behandelt ",45]
["369-313: Laubholz unbehandelt, Nadelholz behandelt, Holzwerkstoff beschichtet   [ND: 30]",369,313,"Laubholz unbehandelt, Nadelholz behandelt, Holzwerkstoff beschichtet ",30]
["369-314: Nadelholz unbehandelt   [ND: 20]",369,314,"Nadelholz unbehandelt ",20]
["369-411: Absturzsicherung, Trittstufen, Laufflächen, Laubund Schneefangvorrichtungen, Blitzschutzanlagen: Stahl feuerverzinkt (stückverzinkt), Stahl nicht rostend  [ND: 50]",369,411,"Absturzsicherung, Trittstufen, Laufflächen, Laubund Schneefangvorrichtungen, Blitzschutzanlagen: Stahl feuerverzinkt (stückverzinkt), Stahl nicht rostend",50]
["369-412: Dachbeund Dachentlüftung Stahl galvanisch verzinkt   [ND: 25]",369,412,"Dachbeund Dachentlüftung Stahl galvanisch verzinkt ",25]
["369-413: Entlüftungsrohre Kunststoff   [ND: 25]",369,413,"Entlüftungsrohre Kunststoff ",25]
["371-111: Möblierungssysteme: Büros, Laboratorien   [ND: 30]",371,111,"Möblierungssysteme: Büros, Laboratorien ",30]
["371-112: Möblierungssysteme: Bildschirmarbeitsplätze, Konferenzräume   [ND: 10]",371,112,"Möblierungssysteme: Bildschirmarbeitsplätze, Konferenzräume ",10]
["371-113: Möblierungssysteme: Bibliotheken, Schutzräume   [ND: 40]",371,113,"Möblierungssysteme: Bibliotheken, Schutzräume ",40]
["371-114: Möblierungssysteme: Kantinen, Rechenzentren   [ND: 15]",371,114,"Möblierungssysteme: Kantinen, Rechenzentren ",15]
["371-115: Möblierungssysteme: Schulungsräume, Schulen   [ND: 20]",371,115,"Möblierungssysteme: Schulungsräume, Schulen ",20]
["371-116: Möblierungssysteme: Kontrollräume, Leitstellen   [ND: 25]",371,116,"Möblierungssysteme: Kontrollräume, Leitstellen ",25]
["371-121: Regale: Stahl, Aluminium, Holzwerkstoff, Kunststoff   [ND: 40]",371,121,"Regale: Stahl, Aluminium, Holzwerkstoff, Kunststoff ",40]
["371-122: Schrankmöbel: Stahl, Stahl nicht rostend, Aluminium, Holzwerkstoff, Kunststoff, Holz   [ND: 30]",371,122,"Schrankmöbel: Stahl, Stahl nicht rostend, Aluminium, Holzwerkstoff, Kunststoff, Holz ",30]
["371-311: Garderobeneinrichtungen: Stahl, Stahl nicht rostend, Messing, Holz, Aluminium   [ND: 20]",371,311,"Garderobeneinrichtungen: Stahl, Stahl nicht rostend, Messing, Holz, Aluminium ",20]
["371-312: Garderobeneinrichtungen: Kunststoff   [ND: 15]",371,312,"Garderobeneinrichtungen: Kunststoff ",15]
["410-001: Gas-, Wasser- und Abwasseranlagen gesamt (AMEV)  [ND: 50]",410,"001","Gas-, Wasser- und Abwasseranlagen gesamt (AMEV)",50]
["420-001: Wärmeversorgungsanlagen gesamt (AMEV)  [ND: 25]",420,"001","Wärmeversorgungsanlagen gesamt (AMEV)",25]
["421-111: Wärmeerzeugungsanlagen gesamt inkl TW (Anlage 3)  [ND: 25]",421,"111","Wärmeerzeugungsanlagen gesamt inkl TW (Anlage 3)",25]
["422-112: Wärmeverteilnetze Heizung gesamt (Anlage3)  [ND: 50]",422,"112","Wärmeverteilnetze Heizung gesamt (Anlage3)",50]
["422-113: Wärmeverteilnetze TW gesamt (Anlage3)  [ND: 25]",422,"113","Wärmeverteilnetze TW gesamt (Anlage3)",25]
["423-111: Raumheizflächen/ Nutzenübergabe Heizung gesamt (Anlage 3)  [ND: 25]",423,"111","Raumheizflächen/ Nutzenübergabe Heizung gesamt (Anlage 3)",25]
["423-112: Raumheizflächen/ Nutzenübergabe TW gesamt (Anlage 3)  [ND: 15]",423,"112","Raumheizflächen/ Nutzenübergabe TW gesamt (Anlage 3)",15]
["429-111: Wasseraufbereitungsanlagen  [ND: 15]",429,"111","Wasseraufbereitungsanlagen",15]
["430-001: Lufttechnische Anlagen gesamt (Anlage 3/ AMEV)  [ND: 25]",430,"001","Lufttechnische Anlagen gesamt (Anlage 3/ AMEV)",25]
["430-002: Nutzenübergabe allgemein (Anlage 3)  [ND: 25]",430,"002","Nutzenübergabe allgemein (Anlage 3)",25]
["430-003: Wärmerückgewinnung (Anlage 3)  [ND: 25]",430,"003","Wärmerückgewinnung (Anlage 3)",25]
["430-004: Luftkühler (Anlage 3)  [ND: 25]",430,"004","Luftkühler (Anlage 3)",25]
["430-005: Kühldecken (Anlage 3)  [ND: 25]",430,"005","Kühldecken (Anlage 3)",25]
["430-006: Be-/ Entfeuchter (Anlage 3)  [ND: 15]",430,"006","Be-/ Entfeuchter (Anlage 3)",15]
["430-007: Verteilung (Anlage 3)  [ND: 25]",430,"007","Verteilung (Anlage 3)",25]
["430-008: Erzeugung Kälte (Anlage 3)  [ND: 15]",430,"008","Erzeugung Kälte (Anlage 3)",15]
["430-009: Erzeugung Wärme (Anlage 3)  [ND: 25]",430,"009","Erzeugung Wärme (Anlage 3)",25]
["440-001: Starkstromanlagen gesamt (Anlage 3/ AMEV)  [ND: 25]",440,"001","Starkstromanlagen gesamt (Anlage 3/ AMEV)",25]
["450-001: Fernmeldetechnische Anlagen gesamt (Anlage 3/ AMEV)  [ND: 25]",450,"001","Fernmeldetechnische Anlagen gesamt (Anlage 3/ AMEV)",25]
["460-001: Aufzüge gesamt (Anlage 3/ AMEV)  [ND: 25]",460,"001","Aufzüge gesamt (Anlage 3/ AMEV)",25]
["470-001: Abfallentsorgungsanlagen (Anlage 3/ AMEV)  [ND: 25]",470,"001","Abfallentsorgungsanlagen (Anlage 3/ AMEV)",25]
["480-001: Gebäudeautomation (FAQ)  [ND: 10]",480,"001","Gebäudeautomation (FAQ)",10]
["490-001: Sonstige Maßnahmen für Technische Anlagen (FAQ)  [ND: 25]",490,"001","Sonstige Maßnahmen für Technische Anlagen (FAQ)",25]
["534-111: Rampen, Treppen, Tribünen nur Kinderwagen- und Behindertenrampen  [ND: 50]",534,"111","Rampen, Treppen, Tribünen nur Kinderwagen- und Behindertenrampen",50]
["537-111: Kanal- und Schachtbauanlagen nur bauliche Anlagen für die Medienerschließung   [ND: 50]",537,"111","Kanal- und Schachtbauanlagen nur bauliche Anlagen für die Medienerschließung ",50]
["538-111: Wasserbauliche Anlagen nur Brunnen für Wasser-Wasser-Wärmepumpen  [ND: 50]",538,"111","Wasserbauliche Anlagen nur Brunnen für Wasser-Wasser-Wärmepumpen",50]
["541-111: Abwasseranlagen in den Außenanlagen   [ND: 50]",541,"111","Abwasseranlagen in den Außenanlagen ",50]
["542-111: Wasseranlagen in den Außenanlagen   [ND: 50]",542,"111","Wasseranlagen in den Außenanlagen ",50]
["543-111: Gasanlagen in den Außenanlagen   [ND: 50]",543,"111","Gasanlagen in den Außenanlagen ",50]
["544-111: Wärmeversorgungsanlagen in den Außenanlagen   [ND: 25]",544,"111","Wärmeversorgungsanlagen in den Außenanlagen ",25]
["545-111: Lufttechnische Anlagen in den Außenanlagen  [ND: 25]",545,"111","Lufttechnische Anlagen in den Außenanlagen",25]
["546-111: Starkstromanlagen in den Außenanlagen   [ND: 25]",546,"111","Starkstromanlagen in den Außenanlagen ",25]
["547-111: Fernmelde- und informationstechnische Anlagen in den Außenanlagen   [ND: 25]",547,"111","Fernmelde- und informationstechnische Anlagen in den Außenanlagen ",25]
["551-111: Allgemeine Einbauten nur Fahrradständer und Abfallbehälter   [ND: 25]",551,"111","Allgemeine Einbauten nur Fahrradständer und Abfallbehälter ",25]
["576-111: Begrünung unterbauter Flächen   [ND: 30]",576,"111","Begrünung unterbauter Flächen ",30]

{"sheet":"KT_DIN276","index":11,"n_rows":186,"n_cols":3,"rows_kept":186,"cut":false,"hidden":true,"merged":[]}
[{"$f":"CONCATENATE(B1,\": \",C1)","v":"300: Bauwerk - Baukonstruktionen"},300,"Bauwerk - Baukonstruktionen"]
["310: Baugrube",310,"Baugrube"]
["311: Baugrubenherstellung",311,"Baugrubenherstellung"]
["312: Baugrubenumschließung",312,"Baugrubenumschließung"]
["313: Wasserhaltung",313,"Wasserhaltung"]
["319: Baugrube, Sonstiges",319,"Baugrube, Sonstiges"]
["320: Gründung",320,"Gründung"]
["321: Baugrundverbesserung",321,"Baugrundverbesserung"]
["322: Flachgründungen",322,"Flachgründungen"]
["323: Tiefgründungen",323,"Tiefgründungen"]
["324: Unterböden und Bodenplatten",324,"Unterböden und Bodenplatten"]
["325: Bodenbeläge",325,"Bodenbeläge"]
["326: Bauwerksabdichtungen",326,"Bauwerksabdichtungen"]
["327: Dränagen",327,"Dränagen"]
["329: Gründungen, Sonstiges",329,"Gründungen, Sonstiges"]
["330: Außenwände",330,"Außenwände"]
["331: Tragende Außenwände",331,"Tragende Außenwände"]
["332: Nichttragende Außenwände",332,"Nichttragende Außenwände"]
["333: Außenstützen",333,"Außenstützen"]
["334: Außentüren und -fenster",334,"Außentüren und -fenster"]
["335: Außenwandbekleidungen, außen",335,"Außenwandbekleidungen, außen"]
["336: Außenwandbekleidungen, innen",336,"Außenwandbekleidungen, innen"]
["337: Elementierte Außenwände",337,"Elementierte Außenwände"]
["338: Sonnenschutz",338,"Sonnenschutz"]
["339: Außenwände, Sonstiges",339,"Außenwände, Sonstiges"]
["340: Innenwände",340,"Innenwände"]
["341: Tragende Innenwände",341,"Tragende Innenwände"]
["342: Nichttragende Innenwände",342,"Nichttragende Innenwände"]
["343: Innenstützen",343,"Innenstützen"]
["344: Innentüren und -fenster",344,"Innentüren und -fenster"]
["345: Innenwandbekleidungen",345,"Innenwandbekleidungen"]
["346: Elementierte Innenwände",346,"Elementierte Innenwände"]
[{"$f":"CONCATENATE(B33,\": \",C33)","v":"349: Innenwände, Sonstiges"},349,"Innenwände, Sonstiges"]
["350: Decken",350,"Decken"]
["351: Deckenkonstruktionen",351,"Deckenkonstruktionen"]
["352: Deckenbeläge",352,"Deckenbeläge"]
["353: Deckenbekleidungen",353,"Deckenbekleidungen"]
["359: Decken, Sonstiges",359,"Decken, Sonstiges"]
["360: Dächer",360,"Dächer"]
["361: Dachkonstruktionen",361,"Dachkonstruktionen"]
["362: Dachfenster, Dachöffnungen",362,"Dachfenster, Dachöffnungen"]
["363: Dachbeläge",363,"Dachbeläge"]
["364: Dachbekleidungen",364,"Dachbekleidungen"]
["369: Dächer, Sonstiges",369,"Dächer, Sonstiges"]
["370: Baukonstruktive Einbauten",370,"Baukonstruktive Einbauten"]
["371: Allgemeine Einbauten",371,"Allgemeine Einbauten"]
["372: Besondere Einbauten",372,"Besondere Einbauten"]
["379: Baukonstruktive Einbauten, Sonstiges",379,"Baukonstruktive Einbauten, Sonstiges"]
["390: Sonstige Maßnahmen für Baukonstruktionen",390,"Sonstige Maßnahmen für Baukonstruktionen"]
["391: Baustelleneinrichtung",391,"Baustelleneinrichtung"]
["392: Gerüste",392,"Gerüste"]
["393: Sicherungsmaßnahmen",393,"Sicherungsmaßnahmen"]
["394: Abbruchmaßnahmen",394,"Abbruchmaßnahmen"]
["395: Instandsetzungen",395,"Instandsetzungen"]
["396: Materialentsorgung",396,"Materialentsorgung"]
["397: Zusätzliche Maßnahmen",397,"Zusätzliche Maßnahmen"]
["398: Provisorische Baukonstruktionen",398,"Provisorische Baukonstruktionen"]
["399: Sonstige Maßnahmen für Baukonstruktionen, Sonstiges",399,"Sonstige Maßnahmen für Baukonstruktionen, Sonstiges"]
["400: Bauwerk - Technische Anlagen",400,"Bauwerk - Technische Anlagen"]
["410: Abwasser-, Wasser-, Gasanlagen",410,"Abwasser-, Wasser-, Gasanlagen"]
["411: Abwasseranlagen",411,"Abwasseranlagen"]
["412: Wasseranlagen",412,"Wasseranlagen"]
["413: Gasanlagen",413,"Gasanlagen"]
["419: Abwasser-, Wasser-, Gasanlagen, Sonstiges",419,"Abwasser-, Wasser-, Gasanlagen, Sonstiges"]
[{"$f":"CONCATENATE(B65,\": \",C65)","v":"420: Wärmeversorgungsanlagen"},420,"Wärmeversorgungsanlagen"]
["421: Wärmeerzeugungsanlagen",421,"Wärmeerzeugungsanlagen"]
["422: Wärmeverteilnetze",422,"Wärmeverteilnetze"]
["423: Raumheizflächen",423,"Raumheizflächen"]
["429: Wärmeversorgungsanlagen, Sonstiges",429,"Wärmeversorgungsanlagen, Sonstiges"]
["430: Lufttechnische Anlagen",430,"Lufttechnische Anlagen"]
["431: Lüftungsanlagen",431,"Lüftungsanlagen"]
["432: Teilklimaanlagen",432,"Teilklimaanlagen"]
["433: Klimaanlagen",433,"Klimaanlagen"]
["434: Kälteanlagen",434,"Kälteanlagen"]
["439: Lufttechnische Anlagen, Sonstiges",439,"Lufttechnische Anlagen, Sonstiges"]
["440: Starkstromanlagen",440,"Starkstromanlagen"]
["441: Hoch- und Mittelspannungsanlagen",441,"Hoch- und Mittelspannungsanlagen"]
["442: Eigenstromversorgungsanlagen",442,"Eigenstromversorgungsanlagen"]
["443: Niederspannungsschaltanlagen",443,"Niederspannungsschaltanlagen"]
["444: Niederspannungsinstallationsanlagen",444,"Niederspannungsinstallationsanlagen"]
["445: Beleuchtungsanlagen",445,"Beleuchtungsanlagen"]
["446: Blitzschutz- und Erdungsanlagen",446,"Blitzschutz- und Erdungsanlagen"]
["449: Starkstromanlagen, Sonstiges",449,"Starkstromanlagen, Sonstiges"]
["450: Fernmelde- und informationstechnische Anlagen",450,"Fernmelde- und informationstechnische Anlagen"]
["451: Telekommunikationsanlagen",451,"Telekommunikationsanlagen"]
["452: Such- und Signalanlagen",452,"Such- und Signalanlagen"]
["453: Zeitdienstanlagen",453,"Zeitdienstanlagen"]
["454: Elektroakustische Anlagen",454,"Elektroakustische Anlagen"]
["455: Fernseh- und Antennenanlagen",455,"Fernseh- und Antennenanlagen"]
["456: Gefahrenmelde- und Alarmanlagen",456,"Gefahrenmelde- und Alarmanlagen"]
["457: Übertragungsnetze",457,"Übertragungsnetze"]
["459: Fernmelde- und informationstechnische Anlagen, Sonst.",459,"Fernmelde- und informationstechnische Anlagen, Sonst."]
["460: Förderanlagen",460,"Förderanlagen"]
["461: Aufzugsanlagen",461,"Aufzugsanlagen"]
["462: Fahrtreppen, Fahrsteige",462,"Fahrtreppen, Fahrsteige"]
["463: Befahranlagen",463,"Befahranlagen"]
[{"$f":"CONCATENATE(B97,\": \",C97)","v":"464: Transportanlagen"},464,"Transportanlagen"]
["465: Krananlagen",465,"Krananlagen"]
["469: Förderanlagen, Sonstiges",469,"Förderanlagen, Sonstiges"]
["470: Nutzungsspezifische Anlagen",470,"Nutzungsspezifische Anlagen"]
["471: Küchentechnische Anlagen",471,"Küchentechnische Anlagen"]
["472: Wäscherei- und Reinigungsanlagen",472,"Wäscherei- und Reinigungsanlagen"]
["473: Medienversorgungsanlagen",473,"Medienversorgungsanlagen"]
["474: Medizin- und labortechnische Anlagen",474,"Medizin- und labortechnische Anlagen"]
["475: Feuerlöschanlagen",475,"Feuerlöschanlagen"]
["476: Badetechnische Anlagen",476,"Badetechnische Anlagen"]
["477: Prozesswärme-, kälte-, und luftanlagen",477,"Prozesswärme-, kälte-, und luftanlagen"]
["478: Entsorgungsanlagen",478,"Entsorgungsanlagen"]
["479: Nutzungsspezifische Anlagen, Sonstiges",479,"Nutzungsspezifische Anlagen, Sonstiges"]
["480: Gebäudeautomation",480,"Gebäudeautomation"]
["481: Automationssysteme",481,"Automationssysteme"]
["482: Schaltschränke",482,"Schaltschränke"]
["483: Management- und Bedieneinrichtungen",483,"Management- und Bedieneinrichtungen"]
["484: Raumautomationssysteme",484,"Raumautomationssysteme"]
["485: Übertragungsnetze",485,"Übertragungsnetze"]
["489: Gebäudeautomation, Sonstiges",489,"Gebäudeautomation, Sonstiges"]
["490: Sonstige Maßnahmen für technische Anlagen",490,"Sonstige Maßnahmen für technische Anlagen"]
["491: Baustelleneinrichtung",491,"Baustelleneinrichtung"]
["492: Gerüste",492,"Gerüste"]
["493: Sicherungsmaßnahmen",493,"Sicherungsmaßnahmen"]
["494: Abbruchmaßnahmen",494,"Abbruchmaßnahmen"]
["495: Instandsetzungen",495,"Instandsetzungen"]
["496: Materialentsorgung",496,"Materialentsorgung"]
["497: Zusätzliche Maßnahmen",497,"Zusätzliche Maßnahmen"]
["498: Provisorische technische Anlagen",498,"Provisorische technische Anlagen"]
["499: Sonstige Maßnahmen für technische Anlagen, Sonst.",499,"Sonstige Maßnahmen für technische Anlagen, Sonst."]
["500: Außenanlagen",500,"Außenanlagen"]
["510: Geländeflächen",510,"Geländeflächen"]
[{"$f":"CONCATENATE(B129,\": \",C129)","v":"511: Oberbodenarbeiten"},511,"Oberbodenarbeiten"]
["512: Bodenarbeiten",512,"Bodenarbeiten"]
["519: Geländeflächen, sonstiges",519,"Geländeflächen, sonstiges"]
["520: Befestigte Flächen",520,"Befestigte Flächen"]
["521: Wege",521,"Wege"]
["522: Straßen",522,"Straßen"]
["523: Plätze, Höfe",523,"Plätze, Höfe"]
["524: Stellplätze",524,"Stellplätze"]
["525: Sportplatzflächen",525,"Sportplatzflächen"]
["526: Spielplatzflächen",526,"Spielplatzflächen"]
["527: Gleisanlagen",527,"Gleisanlagen"]
["529: Befestigte Flächen, sonstiges",529,"Befestigte Flächen, sonstiges"]
["530: Baukonstruktionen in Außenanlagen",530,"Baukonstruktionen in Außenanlagen"]
["531: Einfriedungen",531,"Einfriedungen"]
["532: Schutzkonstruktionen",532,"Schutzkonstruktionen"]
["533: Mauern, Wände",533,"Mauern, Wände"]
["534: Rampen, Treppen, Tribünen",534,"Rampen, Treppen, Tribünen"]
["535: Überdachungen",535,"Überdachungen"]
["536: Brücken, Stege",536,"Brücken, Stege"]
["537: Kanal- und Schachtbauanlagen",537,"Kanal- und Schachtbauanlagen"]
["538: Wasserbauliche Anlagen",538,"Wasserbauliche Anlagen"]
["539: Baukonstruktionen in Außenanlagen, sonstiges",539,"Baukonstruktionen in Außenanlagen, sonstiges"]
["540: Technische Anlagen in Außenanlagen",540,"Technische Anlagen in Außenanlagen"]
["541: Abwasseranlagen",541,"Abwasseranlagen"]
["542: Wasseranlagen",542,"Wasseranlagen"]
["543: Gasanlagen",543,"Gasanlagen"]
["544: Wärmeversorgungsanlagen",544,"Wärmeversorgungsanlagen"]
["545: Lufttechnische Anlagen",545,"Lufttechnische Anlagen"]
["546: Starkstromanlagen",546,"Starkstromanlagen"]
["547: Fernmelde- und informationstechnische Anlagen",547,"Fernmelde- und informationstechnische Anlagen"]
["548: Nutzungsspezifische Anlagen",548,"Nutzungsspezifische Anlagen"]
["549: Technische Anlagen in Außenanlagen, sonstiges",549,"Technische Anlagen in Außenanlagen, sonstiges"]
[{"$f":"CONCATENATE(B161,\": \",C161)","v":"550: Einbauten in Außenanlagen"},550,"Einbauten in Außenanlagen"]
["551: Allgemeine Einbauten",551,"Allgemeine Einbauten"]
["552: Besondere Einbauten",552,"Besondere Einbauten"]
["559: Einbauten in Außenanlagen, sonstiges",559,"Einbauten in Außenanlagen, sonstiges"]
["560: Wasserflächen",560,"Wasserflächen"]
["561: Abdichtungen",561,"Abdichtungen"]
["562: Bepflanzungen",562,"Bepflanzungen"]
["569: Wasserflächen, sonstiges",569,"Wasserflächen, sonstiges"]
["570: Pflanz- und Saatflächen",570,"Pflanz- und Saatflächen"]
["571: Oberbodenarbeiten",571,"Oberbodenarbeiten"]
["572: Vegetationstechnische Bodenbearbeitung",572,"Vegetationstechnische Bodenbearbeitung"]
["573: Sicherungsbauweisen",573,"Sicherungsbauweisen"]
["574: Pflanzen",574,"Pflanzen"]
["575: Rasen und Ansaaten",575,"Rasen und Ansaaten"]
["576: Begrünung unterbauter Flächen",576,"Begrünung unterbauter Flächen"]
["579: Pflanz- und Saatflächen, sonstiges",579,"Pflanz- und Saatflächen, sonstiges"]
["590: Sonstige Außenanlagen",590,"Sonstige Außenanlagen"]
["591: Baustelleneinrichtung",591,"Baustelleneinrichtung"]
["592: Gerüste",592,"Gerüste"]
["593: Sicherungsmaßnahmen",593,"Sicherungsmaßnahmen"]
["594: Abbruchmaßnahmen",594,"Abbruchmaßnahmen"]
["595: Instandsetzungen",595,"Instandsetzungen"]
["596: Materialentsorgung",596,"Materialentsorgung"]
["597: Zusätzliche Maßnahmen",597,"Zusätzliche Maßnahmen"]
["598: Provisorische Außenanlagen",598,"Provisorische Außenanlagen"]
["599: Sonstige Maßnahmen für Außenanlagen, sonstiges",599,"Sonstige Maßnahmen für Außenanlagen, sonstiges"]

{"sheet":"KT_regNutzungskosten","index":12,"n_rows":24,"n_cols":8,"rows_kept":24,"cut":false,"hidden":true,"merged":[]}
[null,"Anzeige Auswahlfeld","Anzeige Auswahlfeld","DIN 276","Ebene 2","Bezeichnung Kostengruppe oder Bauteil/Material","Inspektion und Wartung","Instandsetzung"]
[{"$f":"CONCATENATE(D2,\"-\",E2,\": \",F2,\"  [IW: \",B2,\", IN: \",C2,\"]\")","v":"300-000: Baukonstruktion ohne Inspektion+Wartung  [IW: 0,001, IN: 0,0035]"},{"$f":"G2","v":1E-3},3.5000000000000001E-3,300,"000","Baukonstruktion ohne Inspektion+Wartung",1E-3,3.5000000000000001E-3]
[{"$f":"CONCATENATE(D3,\"-\",E3,\": \",F3,\"  [IW: \",B3,\", IN: \",C3,\"]\")","v":"410-001: Abwasser-, Wasser-, Gasanlagen gesamt (Anlage3/ AMEV)  [IW: 0,0101, IN: 0,0098]"},{"$f":"G3","v":1.01E-2},{"$f":"H3","v":9.7999999999999997E-3},410,"001","Abwasser-, Wasser-, Gasanlagen gesamt (Anlage3/ AMEV)",1.01E-2,9.7999999999999997E-3]
["420-001: Wärmeversorgungsanlagen gesamt (Anlage 3/ AMEV)  [IW: 0,0041, IN: 0,0066]",4.1000000000000003E-3,6.6E-3,420,"001","Wärmeversorgungsanlagen gesamt (Anlage 3/ AMEV)",4.1000000000000003E-3,6.6E-3]
[{"$f":"CONCATENATE(D5,\"-\",E5,\": \",F5,\"  [IW: \",B5,\", IN: \",C5,\"]\")","v":"430-001: Lufttechnische Anlagen gesamt (Anlage 3/ AMEV)  [IW: 0,0096, IN: 0,011]"},9.5999999999999992E-3,1.0999999999999999E-2,430,"001","Lufttechnische Anlagen gesamt (Anlage 3/ AMEV)",9.5999999999999992E-3,1.0999999999999999E-2]
[{"$f":"CONCATENATE(D6,\"-\",E6,\": \",F6,\"  [IW: \",B6,\", IN: \",C6,\"]\")","v":"440-001: Starkstromanlagen gesamt (Anlage 3/ AMEV)  [IW: 0,006, IN: 0,007]"},6.0000000000000001E-3,7.0000000000000001E-3,440,"001","Starkstromanlagen gesamt (Anlage 3/ AMEV)",6.0000000000000001E-3,7.0000000000000001E-3]
[{"$f":"CONCATENATE(D7,\"-\",E7,\": \",F7,\"  [IW: \",B7,\", IN: \",C7,\"]\")","v":"450-001: Fernmeldetechnische Anlagen gesamt (Anlage 3/ AMEV)  [IW: 0,0104, IN: 0,0104]"},1.04E-2,1.04E-2,450,"001","Fernmeldetechnische Anlagen gesamt (Anlage 3/ AMEV)",1.04E-2,1.04E-2]
[{"$f":"CONCATENATE(D8,\"-\",E8,\": \",F8,\"  [IW: \",B8,\", IN: \",C8,\"]\")","v":"460-001: Aufzüge gesamt (Anlage 3/ AMEV)  [IW: 0,0176, IN: 0,0178]"},1.7600000000000001E-2,1.78E-2,460,"001","Aufzüge gesamt (Anlage 3/ AMEV)",1.7600000000000001E-2,1.78E-2]
["470-111: Abfallentsorgungsanlagen (Anlage 3/ AMEV)  [IW: 0,016, IN: 0,014]",1.6E-2,1.4E-2,470,"111","Abfallentsorgungsanlagen (Anlage 3/ AMEV)",1.6E-2,1.4E-2]
[{"$f":"CONCATENATE(D10,\"-\",E10,\": \",F10,\"  [IW: \",B10,\", IN: \",C10,\"]\")","v":"480-111: Gebäudeautomation (FAQ)  [IW: 0,0116, IN: 0,0076]"},1.1599999999999999E-2,7.6E-3,480,"111","Gebäudeautomation (FAQ)",1.1599999999999999E-2,7.6E-3]
["490-111: Sonstige Maßnahmen für Technische Anlagen (FAQ)  [IW: 0,005, IN: 0,005]",5.0000000000000001E-3,5.0000000000000001E-3,490,"111","Sonstige Maßnahmen für Technische Anlagen (FAQ)",5.0000000000000001E-3,5.0000000000000001E-3]
["534-111: Rampen, Treppen, Tribünen nur Kinderwagen- und Behindertenrampen  [IW: 0,001, IN: 0,0035]",1E-3,3.5000000000000001E-3,534,"111","Rampen, Treppen, Tribünen nur Kinderwagen- und Behindertenrampen",1E-3,3.5000000000000001E-3]
["535-111: Überdachungen nur Fahrradstellplätze  [IW: 0,001, IN: 0,0035]",1E-3,3.5000000000000001E-3,535,"111","Überdachungen nur Fahrradstellplätze",1E-3,3.5000000000000001E-3]
["537-111: Kanal- und Schachtbauanlagen nur bauliche Anlagen für die Medienerschließung   [IW: 0,001, IN: 0,0035]",1E-3,3.5000000000000001E-3,537,"111","Kanal- und Schachtbauanlagen nur bauliche Anlagen für die Medienerschließung ",1E-3,3.5000000000000001E-3]
["538-111: Wasserbauliche Anlagen nur Brunnen für Wasser-Wasser-Wärmepumpen  [IW: 0,001, IN: 0,0035]",1E-3,3.5000000000000001E-3,538,"111","Wasserbauliche Anlagen nur Brunnen für Wasser-Wasser-Wärmepumpen",1E-3,3.5000000000000001E-3]
["541-111: Abwasseranlagen in den Außenanlagen   [IW: 0,0093, IN: 0,0107]",9.2999999999999992E-3,1.0699999999999999E-2,541,"111","Abwasseranlagen in den Außenanlagen ",9.2999999999999992E-3,1.0699999999999999E-2]
["542-111: Wasseranlagen in den Außenanlagen   [IW: 0,0093, IN: 0,0107]",9.2999999999999992E-3,1.0699999999999999E-2,542,"111","Wasseranlagen in den Außenanlagen ",9.2999999999999992E-3,1.0699999999999999E-2]
["543-111: Gasanlagen in den Außenanlagen   [IW: 0,0093, IN: 0,0107]",9.2999999999999992E-3,1.0699999999999999E-2,543,"111","Gasanlagen in den Außenanlagen ",9.2999999999999992E-3,1.0699999999999999E-2]
["544-111: Wärmeversorgungsanlagen in den Außenanlagen   [IW: 0,0088, IN: 0,008]",8.8000000000000005E-3,8.0000000000000002E-3,544,"111","Wärmeversorgungsanlagen in den Außenanlagen ",8.8000000000000005E-3,8.0000000000000002E-3]
["545-111: Lufttechnische Anlagen in den Außenanlagen  [IW: 0,0088, IN: 0,008]",8.8000000000000005E-3,8.0000000000000002E-3,545,"111","Lufttechnische Anlagen in den Außenanlagen",8.8000000000000005E-3,8.0000000000000002E-3]
["546-111: Starkstromanlagen in den Außenanlagen   [IW: 0,0043, IN: 0,0107]",4.3E-3,1.0699999999999999E-2,546,"111","Starkstromanlagen in den Außenanlagen ",4.3E-3,1.0699999999999999E-2]
["547-111: Fernmelde- und informationstechnische Anlagen in den Außenanlagen   [IW: 0,0043, IN: 0,0107]",4.3E-3,1.0699999999999999E-2,547,"111","Fernmelde- und informationstechnische Anlagen in den Außenanlagen ",4.3E-3,1.0699999999999999E-2]
["551-111: Allgemeine Einbauten nur Fahrradständer und Abfallbehälter   [IW: 0,001, IN: 0,0035]",1E-3,3.5000000000000001E-3,551,"111","Allgemeine Einbauten nur Fahrradständer und Abfallbehälter ",1E-3,3.5000000000000001E-3]
["576-111: Begrünung unterbauter Flächen   [IW: 0,001, IN: 0,0035]",1E-3,3.5000000000000001E-3,576,"111","Begrünung unterbauter Flächen ",1E-3,3.5000000000000001E-3]

{"sheet":"KT Energieträger","index":13,"n_rows":18,"n_cols":11,"rows_kept":18,"cut":false,"hidden":true,"merged":[[14,9,14,10],[6,9,6,10],[6,6,6,8],[0,9,0,10],[0,6,0,8],[10,9,10,10]]}
["Nr.","Energieträger","Faktor Hs/Hi\nnach DIN 18599","Euro je kWh",null,null,"Heizöl",null,null,"Erdgas"]
[1,"Elektroenergie - Strom-Mix - Arbeit",1,0.2,null,null,"Heizwert",11.9,"kWh/kg",10,"kWh/m³"]
[2,"Elektroenergie - Strom-Mix - Wärme",1,0.2,null,null,"Dichte",0.84,"kg/l"]
[3,"Gas - Erdgas",1.1100000000000001,0.06,null,null,"Heizwert",{"$f":"H2*H3","v":9.9960000000000004},"kWh/l"]
[4,"Holz - Pellets",1.08,5.7000000000000002E-2,null,null,"Preis",0.85,"€/l",0.62,"€/m³"]
[5,"Fernwärme/ KWK - erneuerbar",1,7.6999999999999999E-2,null,null,"Preis",{"$f":"H5/H4","v":8.5034013605442174E-2},"€/kWh",{"$f":"J5/J2","v":6.2E-2},"€/kWh"]
[6,"Fernwärme/ KWK - fossil",1,7.6999999999999999E-2,null,null,"Fernwärme",null,null,"Pellets"]
[7,"Öl - Heizöl",1.06,7.0000000000000007E-2,null,null,"fossil",0.09,"€/kWh",4.4000000000000004,"kWh/kg"]
[8,"Braunkohle",1.07,{"$f":"J14","v":7.0921985815602842E-2},null,null,"erneuerbar",7.0000000000000007E-2,"€/kWh",0.18,"€/kg"]
[9,"Steinkohle",1.02,{"$f":"J18","v":7.8828828828828815E-2},null,null,null,null,null,{"$f":"J9/J8","v":4.0909090909090902E-2},"€/kWh"]
[null,null,null,null,null,null,null,null,null,"Braunkohle"]
[null,null,null,null,null,null,null,null,null,7.05,"kWh/kg"]
[null,null,null,null,null,null,null,null,null,0.5,"€/kg"]
[null,null,null,null,null,null,null,null,null,{"$f":"J13/J12","v":7.0921985815602842E-2},"€/kWh"]
[null,null,null,null,null,null,null,null,null,"Steinkohle"]
[null,null,null,null,null,null,null,null,null,8.8800000000000008,"kWh/kg"]
[null,null,null,null,null,null,null,null,null,0.7,"€/kg"]
[null,null,null,null,null,null,null,null,null,{"$f":"J17/J16","v":7.8828828828828815E-2},"€/kWh"]

{"sheet":"Konfiguration","index":14,"n_rows":20,"n_cols":14,"rows_kept":20,"cut":false,"hidden":false,"merged":[[12,4,14,6],[19,1,19,2],[17,0,17,2],[18,1,18,2],[14,1,14,2],[15,1,15,2],[16,1,16,2],[8,1,8,2],[9,1,9,2],[13,0,13,2],[7,0,7,2],[1,0,1,2],[12,1,12,2],[2,1,2,2]]}
["Regelungsbereich","Vorgabewert BNB","Berechnungsgrundlage"]
["Allgemeine Berechnungsgrundlagen",null,null,null,null,null,null,null,null,null,null,null,null,"BNB_BN 2015"]
["BNB-Systemvariante","BNB_BN 2015",null,null,null,null,null,null,null,null,null,null,null,"BNB_UN 2017 Schulgebäude"]
["Betrachtungszeitraum in Jahren",50,50]
["Allg. Preissteigerung in %",0.02,0.02]
["Preissteigerung Energie in %",0.05,0.05]
["Kalkulationszins in %",1.4999999999999999E-2,1.4999999999999999E-2]
["Preisindizierung"]
["Basisjahr für die Preisindizierung","4. Quartal 2014"]
["Preisstand Basisjahr in % ",1.1000000000000001]
["Preisstand Projekt",null,"4. Quartal 2015",null,"Baupreisindex siehe statistisches Bundesamt:"]
["Preisindex Projekt (zu Basisjahr)  in %",null,1.1200000000000001,null,"\nhttps://www.destatis.de/DE/ZahlenFakten/Indikatoren/Konjunkturindikatoren/Preise/bpr110.html"]
["Faktor Preisindizierung",{"$f":"B10/C12","v":0.9821428571428571},null,null,"Die Preisindex-Berechnung setzt den Wert des Basisjahres (4.Quartal 2014) mit dem Projekt-Preisindex ins Verhältnis, dessen Preisstand aus dem oben genannten Link zu entnehmen ist."]
["Berechnungsgrundlagen Kosten der Wasserver- und entsorgung"]
["Kosten Frischwasser in €",2.0099999999999998]
["Kosten Niederschlagswasser in €",1.1000000000000001]
["Kosten Abwasser aus Brauchwasser in €",2.14]
["Projektdaten"]
["Kategorie der Lebenszykluskosten\nnach Kriteriensteckbrief BNB_BN 2.1.1 v2011_1",1]
["Bruttogrundfläche (BGF)",8000]

{"sheet":"Gültigkeiten","index":15,"n_rows":36,"n_cols":1,"rows_kept":36,"cut":false,"hidden":true,"merged":[]}
["Ja/Nein"]
["Ja"]
["Nein"]
[]
["Einheiten"]
["d"]
["h"]
["kg"]
["km"]
["KW"]
["KWh"]
["l"]
["l/h"]
["liter"]
["m"]
["m²"]
["m³"]
["MW"]
["MWh"]
["Pers"]
["pschl."]
["Stk"]
["t"]
["t"]
["Wo"]
[]
[]
["Seiten"]
[1]
[2]
[]
[]
[]
["LCC_Kategorie"]
[1]
[2]

{"sheet":"Tabelle2","index":16,"n_rows":44,"n_cols":8,"rows_kept":44,"cut":false,"hidden":true,"merged":[]}
[]
[311,"311: Baugrubenherstellung","Ja","Nein",null,157578.99159663866,{"$f":"LEFT(A2,2) & \"0\"","v":"310"},550154.62184873957]
[312,"312: Baugrubenumschließung","Ja","Nein",null,159443.69747899161]
[313,"313: Wasserhaltung","Ja","Nein",null,195520.16806722691]
[319,"319: Baugrube, Sonstiges","Ja","Nein",null,37611.764705882357]
[321,"321: Baugrundverbesserung","Ja","Nein",null,44023.529411764706,{"$f":"LEFT(A6,2) & \"0\"","v":"320"},298700]
[324,"324: Unterböden und Bodenplatten","Ja","Nein",null,170235.29411764708]
[325,"325: Bodenbeläge","Ja","Nein",null,11926.050420168067]
[326,"326: Bauwerksabdichtungen","Ja","Nein",null,64239.495798319331]
[329,"329: Gründungen, Sonstiges","Ja","Nein",null,8275.6302521008402]
[331,"331: Tragende Außenwände","Ja","Nein",null,304150.42016806721,"330",2029994.9579831932]
[334,"334: Außentüren und -fenster","Ja","Nein",null,714758.82352941181]
[335,"335: Außenwandbekleidungen, außen","Ja","Nein",null,871488.23529411771]
[336,"336: Außenwandbekleidungen, innen","Ja","Nein",null,32942.016806722691]
[338,"338: Sonnenschutz","Ja","Nein",null,106655.46218487395]
[341,"341: Tragende Innenwände","Ja","Nein",null,150701.68067226891,"340",1067725.2100840337]
[342,"342: Nichttragende Innenwände","Ja","Nein",null,264642.85714285716]
[343,"343: Innenstützen","Ja","Nein",null,25915.966386554624]
[344,"344: Innentüren und -fenster","Ja","Nein",null,396193.27731092437]
[345,"345: Innenwandbekleidungen","Ja","Nein",null,97473.109243697487]
[349,"349: Innenwände, Sonstiges","Ja","Nein",null,132798.31932773109]
[351,"351: Deckenkonstruktionen","Ja","Nein",null,502252.10084033618,"350",1352342.0168067226]
[352,"352: Deckenbeläge","Ja","Nein",null,646893.27731092437]
[353,"353: Deckenbekleidungen","Ja","Nein",null,174121.00840336134]
[359,"359: Decken, Sonstiges","Ja","Nein",null,29075.63025210084]
[361,"361: Dachkonstruktionen","Ja","Nein",null,153487.3949579832,"360",357843.69747899158]
[362,"362: Dachfenster, Dachöffnungen","Ja","Nein",null,3000]
[363,"363: Dachbeläge","Ja","Nein",null,137062.18487394959]
[364,"364: Dachbekleidungen","Ja","Nein",null,23550.420168067227]
[369,"369: Dächer, Sonstiges","Ja","Nein",null,40743.697478991598]
[371,"371: Allgemeine Einbauten","Ja","Nein",null,63865.546218487398,"370",63865.546218487398]
[390,"390: Sonstige Maßnahmen für Baukonstruktionen","Ja","Nein",null,307923.5294117647,"390",307923.5294117647]
[410,"410: Abwasser-, Wasser-, Gasanlagen","Ja","Nein",null,308900,"410",308900]
[421,"421: Wärmeerzeugungsanlagen","Ja","Nein",null,43152.100840336134,"420",287012.60504201677]
[422,"422: Wärmeverteilnetze","Ja","Nein",null,129169.74789915967]
[423,"423: Raumheizflächen","Ja","Nein",null,94040.336134453784]
[429,"429: Wärmeversorgungsanlagen, Sonstiges","Ja","Nein",null,20650.420168067227]
[430,"430: Lufttechnische Anlagen","Ja","Nein",null,420790.91596638656,"430",420790.91596638656]
[440,"440: Starkstromanlagen","Ja","Nein",null,727358.82352941181,"440",727358.82352941181]
[450,"450: Fernmelde- und informationstechnische Anlagen","Ja","Nein",null,358240.92436974793,"450",358240.92436974793]
[460,"460: Förderanlagen","Ja","Nein",null,100500,"460",100500]
[479,"479: Nutzungsspezifische Anlagen, Sonstiges","Ja","Nein",null,34060,"470",34060]
[480,"480: Gebäudeautomation","Ja","Nein",null,139825,"480",139825]
[490,"490: Sonstige Maßnahmen für technische Anlagen","Ja","Nein",null,38114.285714285717,"490",38114.285714285717]